{"text_format":"1","workbook":"xlsx","n_sheets":15,"sheets":["YARIŞMA BİLGİLERİ","YARIŞMA PROGRAMI","PUAN","100m.","200m.","400m.","100m. Final","800m.","3000m.","Yüksek","Uzun","Gülle","4x100m.","İsveç","Genel Puan Tablosu"],"not_rendered":{"charts":0,"images":14,"macros":1,"external_links":0,"defined_names":210,"comments":0,"pivot_tables":0},"unopened":[],"bounds":{"document_bytes":16777216,"sheet_cells":100000,"rows_first":2000,"rows_last":500,"rows_between":2000,"halvings":0,"cell_chars":16384,"cell_head_chars":4096},"cells_cut":0,"cells_raw":0,"read":"whole","date_system":"1900"}

{"sheet":"YARIŞMA BİLGİLERİ","index":0,"n_rows":24,"n_cols":6,"rows_kept":24,"cut":false,"hidden":false,"merged":[[26,0,26,10],[24,0,24,10],[18,0,18,4],[19,0,19,4],[20,0,20,4],[21,0,21,4],[22,0,22,4],[1,0,1,10],[12,0,12,10],[14,0,14,10],[13,0,13,10],[23,0,23,4],[18,5,18,10],[19,5,19,10],[17,0,17,10],[11,0,11,10],[16,0,16,10],[20,5,20,10],[21,5,21,10]]}
[]
[]
[]
[]
[]
[]
[]
[]
{"$rows_left_out":17}
{"sheet":"YARIŞMA PROGRAMI","index":1,"n_rows":22,"n_cols":8,"rows_kept":22,"cut":false,"hidden":false,"merged":[[8,2,8,3],[9,2,9,3],[15,2,15,3],[16,2,16,3],[17,2,17,3],[10,2,10,3],[11,2,11,3],[12,2,12,3],[13,2,13,3],[14,2,14,3],[5,2,5,4],[6,2,6,3],[7,2,7,3],[0,7,2,7],[2,1,2,4],[1,1,1,4],[3,1,3,4],[4,1,4,4]]}
[null,null,null,null,null,null,null,"Diskalifiye Nedenleri ve Kural Numaraları"]
[null,{"$f":"'YARIŞMA BİLGİLERİ'!F19","v":"KOÇ TOPLULUĞU SPOR ŞENLİĞİ PUANLI ATLETİZM YARIŞLARI"}]
[null,"YARIŞMA PROGRAMI"]
[null,"Bakmak istediğiniz branş üzerine \"Tıkla\"yınız…",null,null,null,null,null,"KURAL 125.5 : Yarışmalar esnasında sportmenlik dışı davranışlarda bulunan sporcu IAAF Kural 125.5 gereği diskalifiye edilecektir. Sporcunun yarışmanın devamındaki diğer branşlara katılması da engellenecektir. “Bu kurala göre diskalifiye edilen atletin, diskalifiye edildiği yarıştaki dereceleri geçersizdir.” Yarışma sonucunda o atletin karşısında sadece “DQ 125.5” yazacak. Tüm uyarılar ve diskalifikasyonlar (yani sarı ve kırmızı kartlar) yarışma sekreterliğine ve tüm başhakemlere bildirilecektir."]
[null,{"$f":"'YARIŞMA BİLGİLERİ'!F21","v":"Kadınlar"},null,null,null,null,null,"KURAL 144.2 : Yarışma sırasında kurallar dışında yardım alan veya yardım veren atlet, başhakem tarafından önce sarı kartla uyarılır, tekrarı halinde IAAF Kural 144.2’ye göre diskalifiye edilir. Yarışma alanında telefon, telsiz, radyo, kasetçalar vb. cihazlar kullanılması, atlete avantaj sağlayacak şekilde yay, tekerlek vb. donanıma sahip ayakkabıların giyilmesi, atma aletlerinin normal ölçülerine eklerin yapılması, “kural dışı yardım” kabul edilir. Mesafe koşularında tur yemiş ya da tur yemek üzere olan atletlerin tempo vermesi, IAAF Kural 144.2 çerçevesinde her iki atletin de diskalifiye edilmesini gerektirir.  "]
[null,"SAAT","BRANŞ",null,null,null,null,"KURAL 162.5 :Yerlerinize ya da dikkat komutundan sonra makul bir sürede pozisyon almayan ve yerlerinize komutundan sonra sesle ya da başka şekilde diğer atlet(ler)i rahatsız eden atlet(ler) önce sarı kart, tekrarı halinde kırmızı kart görür.” Eğer başhakem, starterin kararıyla mutabık değilse, tüm atletlere yeşil kart gösterilir. Bu kural sadece starteri/start başhakemini ilgilendirir."]
[null,"2017-04-15T11:10:00","100 Metre",null," ",null,null,"KURAL 162.7 : Hatalı çıkış yapan her atlet diskalifiye edilir. Yarışmada ilk hatalı çıkışı yapan sporcu dahil, hatalı çıkış yapan tüm atletler IAAF Kural 162.7 gereği diskalifiye edilecektir."]
[null,"15 Nisan 2017 - 12:45","200 Metre",null," ",null,null,"KURAL 163.2 : Yarışma içerisinde bir sporcunun iterek veya çelme takarak, kasıtlı olarak bir başka sporcunun düşmesine neden olması diskalifiye sebebidir. Bunu yapan sporcu IAAF Kural 163.2 gereği diskalifiye edilecektir. (Bu tip olaylarda yardımcı hakem sarı bayrağını kaldıracak ve başhakemi bilgilendirecektir. Diskalifiye olup olmayacağına başhakem karar verecektir.) "]
{"$rows_left_out":15}
{"sheet":"PUAN","index":2,"n_rows":109,"n_cols":32,"rows_kept":109,"cut":false,"hidden":true,"merged":[[0,0,0,31],[1,24,1,27],[1,28,1,30],[1,31,3,31],[1,20,1,22],[1,0,1,18],[1,23,2,23]]}
["GENÇ VE YILDIZ ERKEKLER PUAN TABLOSU"]
["KOŞULAR",null,null,null,null,null,null,null,null,null,null,null,null,null,null,null,null,null,null,null,"BAYRAK",null,null,"PUAN","ATLAMALAR",null,null,null,"ATMALAR",null,null,"PUAN"]
["100m",null,"200m","PUAN","300m\nYıldız","PUAN","400m","PUAN","100 m H\n110m H","PUAN","300m H","PUAN","800m","PUAN","1500m","PUAN","2000m\nYıldız","PUAN","3000m","PUAN","4X100M\nYıldız","PUAN","İsveç \nBayrak",null,"Yüksek","Uzun","Üçadım","Sırık","Gülle","Disk","Cirit"]
["DERECE",null,"DERECE",null,"DERECE",null,"DERECE",null,"DERECE",null,"DERECE",null,"DERECE",null,"DERECE",null,"DERECE",null,"DERECE",null,"DERECE",null,"DERECE",null,"DERECE","DERECE","DERECE","DERECE","DERECE","DERECE","DERECE"]
[null,null,null,null,null,null,null,null,null,null,null,null,null,null,null,null,null,null,null,null,null,null,null,null,1,1,1,1,1,1,1,0]
[1040,null,2089,100,3600,100,4644,100,1380,100,3614,100,14824,100,34624,100,54524,100,81024,100,4764,100,15624,100,98,310,760,130,430,1000,1000,1]
[1042,null,2094,99,3620,99,4654,99,1384,99,3619,99,14844,99,34654,99,54624,99,81124,99,4774,99,15654,99,100,317,754,140,447,1060,1120,2]
[1044,null,2099,98,3640,98,4664,98,1388,98,3624,98,14864,98,34684,98,54724,98,81224,98,4784,98,15684,98,102,324,768,145,464,1120,1200,3]
{"$rows_left_out":102}
{"sheet":"100m.","index":3,"n_rows":57,"n_cols":17,"rows_kept":57,"cut":false,"hidden":false,"merged":[[4,13,4,16],[2,13,2,16],[3,13,3,16],[5,5,6,5],[5,1,6,1],[5,2,6,2],[5,3,6,3],[2,8,2,10],[5,6,6,6],[3,0,3,2],[3,3,3,4],[5,0,6,0],[5,4,6,4],[0,0,0,16],[1,0,1,16],[2,0,2,2],[2,3,2,4],[2,5,2,6]]}
[]
[{"$f":"'YARIŞMA BİLGİLERİ'!F19","v":"KOÇ TOPLULUĞU SPOR ŞENLİĞİ PUANLI ATLETİZM YARIŞLARI"}]
["Yarışma :",null,null,{"$f":"'YARIŞMA PROGRAMI'!C15","v":"100 Metre Final"},null,null,null,":"]
["Kategori :",null,null,{"$f":"'YARIŞMA BİLGİLERİ'!F21","v":"Kadınlar"},null,null,null,null,null,null,null,null,"Tarih-Saat :",{"$f":"'YARIŞMA PROGRAMI'!B7","v":42840.465277777781}]
[null,null,null,null,null,null,null,null,null,null,null,null,null,{"$f":"NOW()","v":42842.612082291664}]
["Sıra No","Göğüs No","Doğum Tarihi\nGün/Ay/Yıl","Adı ve Soyadı","TAKIMI","Derece","Puan",null,"1. SERİ",null,null,null,"Rüzgar:","-0.6"]
[null,null,null,null,null,null,null,null,"Kulvar","Formül","Göğüs No","Doğum Tarihi","Adı ve Soyadı","TAKIMI","Elektronik Kronometre","El Kronometre","Seri Geliş"]
[1,null,null,"CANAN FİL","FORD OTOSAN",1425,11,null,1,"100M-1-1",{"$f":"IF(ISERROR(VLOOKUP(J8,#REF!,2,0)),\"\",(VLOOKUP(J8,#REF!,2,0)))","v":""},{"$f":"IF(ISERROR(VLOOKUP(J8,#REF!,4,0)),\"\",(VLOOKUP(J8,#REF!,4,0)))","v":""},{"$f":"IF(ISERROR(VLOOKUP(J8,#REF!,5,0)),\"\",(VLOOKUP(J8,#REF!,5,0)))","v":""},{"$f":"IF(ISERROR(VLOOKUP(J8,#REF!,6,0)),\"\",(VLOOKUP(J8,#REF!,6,0)))","v":""}]
{"$rows_left_out":50}
{"sheet":"200m.","index":4,"n_rows":47,"n_cols":17,"rows_kept":47,"cut":false,"hidden":false,"merged":[[5,3,6,3],[5,4,6,4],[2,13,2,16],[2,8,2,10],[5,0,6,0],[5,1,6,1],[3,0,3,2],[3,3,3,4],[3,13,3,16],[4,13,4,16],[5,6,6,6],[5,5,6,5],[5,2,6,2],[0,0,0,16],[1,0,1,16],[2,0,2,2],[2,3,2,4],[2,5,2,6]]}
[]
[{"$f":"'YARIŞMA BİLGİLERİ'!F19","v":"KOÇ TOPLULUĞU SPOR ŞENLİĞİ PUANLI ATLETİZM YARIŞLARI"}]
["Yarışma :",null,null,"200 Metre",null,null,null,":"]
["Kategori :",null,null,{"$f":"'YARIŞMA BİLGİLERİ'!F21","v":"Kadınlar"},null,null,null,null,null,null,null,null,"Tarih-Saat :",{"$f":"'YARIŞMA PROGRAMI'!B8","v":"15 Nisan 2017 - 12:45"}]
[null,null,null,null,null,null,null,null,null,null,null,null,null,{"$f":"NOW()","v":42842.612082291664}]
["Sıra No","Göğüs No","Doğum Tarihi\nGün/Ay/Yıl","Adı ve Soyadı","Okulu","Derece","Puan",null,"1. SERİ"]
[null,null,null,null,null,null,null,null,"Kulvar","Formül","Göğüs No","Doğum Tarihi","Adı ve Soyadı","Okulu","Elektronik Kronometre","El Kronometre","Seri Geliş"]
[1,null,null,"İNCİ ÖZDEMİR","FORD OTOSAN",3365,11,null,1,"300M-1-1",{"$f":"IF(ISERROR(VLOOKUP(J8,#REF!,2,0)),\"\",(VLOOKUP(J8,#REF!,2,0)))","v":""},{"$f":"IF(ISERROR(VLOOKUP(J8,#REF!,4,0)),\"\",(VLOOKUP(J8,#REF!,4,0)))","v":""},{"$f":"IF(ISERROR(VLOOKUP(J8,#REF!,5,0)),\"\",(VLOOKUP(J8,#REF!,5,0)))","v":""},{"$f":"IF(ISERROR(VLOOKUP(J8,#REF!,6,0)),\"\",(VLOOKUP(J8,#REF!,6,0)))","v":""}]
{"$rows_left_out":40}
{"sheet":"400m.","index":5,"n_rows":37,"n_cols":17,"rows_kept":37,"cut":false,"hidden":false,"merged":[[5,3,6,3],[5,4,6,4],[2,13,2,16],[2,8,2,10],[5,0,6,0],[5,1,6,1],[3,0,3,2],[3,3,3,4],[3,13,3,16],[4,13,4,16],[5,6,6,6],[5,5,6,5],[5,2,6,2],[0,0,0,16],[1,0,1,16],[2,0,2,2],[2,3,2,4],[2,5,2,6]]}
[]
[{"$f":"'YARIŞMA BİLGİLERİ'!F19","v":"KOÇ TOPLULUĞU SPOR ŞENLİĞİ PUANLI ATLETİZM YARIŞLARI"}]
["Yarışma :",null,null,"400 Metre",null,null,null,":"]
["Kategori :",null,null,{"$f":"'YARIŞMA BİLGİLERİ'!F21","v":"Kadınlar"},null,null,null,null,null,null,null,null,"Tarih-Saat :",{"$f":"'YARIŞMA PROGRAMI'!B11","v":"2017-04-15T12:15:00"}]
[null,null,null,null,null,null,null,null,null,null,null,null,null,{"$f":"NOW()","v":42842.612082291664}]
["Sıra No","Göğüs No","Doğum Tarihi\nGün/Ay/Yıl","Adı ve Soyadı","TAKIMI","Derece","Puan",null,"1. SERİ",null,null,null,"Rüzgar:"]
[null,null,null,null,null,null,null,null,"Kulvar","Formül","Göğüs No","Doğum Tarihi","Adı ve Soyadı","TAKIMI","Elektronik Kronometre","El Kronometre","Seri Geliş"]
[1,null,null,"JALE YENGİNER AKTAŞ","FORD OTOSAN",11460,11,null,1,"100M.ENG-1-1",{"$f":"IF(ISERROR(VLOOKUP(J8,#REF!,2,0)),\"\",(VLOOKUP(J8,#REF!,2,0)))","v":""},{"$f":"IF(ISERROR(VLOOKUP(J8,#REF!,4,0)),\"\",(VLOOKUP(J8,#REF!,4,0)))","v":""},{"$f":"IF(ISERROR(VLOOKUP(J8,#REF!,5,0)),\"\",(VLOOKUP(J8,#REF!,5,0)))","v":""},{"$f":"IF(ISERROR(VLOOKUP(J8,#REF!,6,0)),\"\",(VLOOKUP(J8,#REF!,6,0)))","v":""}]
{"$rows_left_out":30}
{"sheet":"100m. Final","index":6,"n_rows":58,"n_cols":17,"rows_kept":58,"cut":false,"hidden":false,"merged":[[5,6,6,6],[3,0,3,2],[3,3,3,4],[3,13,3,16],[4,13,4,16],[5,0,6,0],[5,1,6,1],[5,2,6,2],[5,3,6,3],[5,4,6,4],[5,5,6,5],[0,0,0,16],[1,0,1,16],[2,0,2,2],[2,3,2,4],[2,5,2,6],[2,8,2,10],[2,13,2,16]]}
[]
[{"$f":"'YARIŞMA BİLGİLERİ'!F19","v":"KOÇ TOPLULUĞU SPOR ŞENLİĞİ PUANLI ATLETİZM YARIŞLARI"}]
["Yarışma :",null,null,{"$f":"'YARIŞMA PROGRAMI'!C7","v":"100 Metre"},null,null,null,":"]
["Kategori :",null,null,{"$f":"'YARIŞMA BİLGİLERİ'!F21","v":"Kadınlar"},null,null,null,null,null,null,null,null,"Tarih-Saat :",{"$f":"'YARIŞMA PROGRAMI'!B15","v":"15 Nisan 2017 - 14:14"}]
[null,null,null,null,null,null,null,null,null,null,null,null,null,{"$f":"NOW()","v":42842.612082291664}]
["Sıra No","Göğüs No","Doğum Tarihi\nGün/Ay/Yıl","Adı ve Soyadı","TAKIMI","Derece","Puan",null,"1. SERİ",null,null,null,"Rüzgar:","+0.8"]
[null,null,null,null,null,null,null,null,"Kulvar","Formül","Göğüs No","Doğum Tarihi","Adı ve Soyadı","TAKIMI","Elektronik Kronometre","El Kronometre","Seri Geliş"]
[1,null,null,"CANAN FİL","FORD OTOSAN",1430,null,null,1,"100M-1-1",{"$f":"IF(ISERROR(VLOOKUP(J8,#REF!,2,0)),\"\",(VLOOKUP(J8,#REF!,2,0)))","v":""},{"$f":"IF(ISERROR(VLOOKUP(J8,#REF!,4,0)),\"\",(VLOOKUP(J8,#REF!,4,0)))","v":""},{"$f":"IF(ISERROR(VLOOKUP(J8,#REF!,5,0)),\"\",(VLOOKUP(J8,#REF!,5,0)))","v":""},{"$f":"IF(ISERROR(VLOOKUP(J8,#REF!,6,0)),\"\",(VLOOKUP(J8,#REF!,6,0)))","v":""}]
{"$rows_left_out":51}
{"sheet":"800m.","index":7,"n_rows":42,"n_cols":17,"rows_kept":42,"cut":false,"hidden":false,"merged":[[0,0,0,16],[1,0,1,16],[2,0,2,2],[2,3,2,4],[2,5,2,6],[2,13,2,16],[5,5,6,5],[5,2,6,2],[5,3,6,3],[2,8,2,10],[4,13,4,16],[5,6,6,6],[3,13,3,16],[3,0,3,2],[3,3,3,4],[5,0,6,0],[5,1,6,1],[5,4,6,4]]}
[]
[{"$f":"'YARIŞMA BİLGİLERİ'!F19","v":"KOÇ TOPLULUĞU SPOR ŞENLİĞİ PUANLI ATLETİZM YARIŞLARI"}]
["Yarışma :",null,null,{"$f":"'YARIŞMA PROGRAMI'!C9","v":"800 Metre"},null,null,null,":"]
["Kategori :",null,null,{"$f":"'YARIŞMA BİLGİLERİ'!F21","v":"Kadınlar"},null,null,null,null,null,null,null,null,"Tarih-Saat ",{"$f":"'YARIŞMA PROGRAMI'!B9","v":"2017-04-15T15:15:00"}]
[null,null,null,null,null,null,null,null,null,null,null,null,null,{"$f":"NOW()","v":42842.612082291664}]
["Sıra No","Göğüs No","Doğum Tarihi\nGün/Ay/Yıl","Adı ve Soyadı","Okulu","Derece","Puan",null,"1. SERİ"]
[null,null,null,null,null,null,null,null,"Kulvar","Formül","Göğüs No","Doğum Tarihi","Adı ve Soyadı","Okulu","Elektronik Kronometre","El Kronometre","Seri Geliş"]
[1,null,null,"SEMA KUNUK","FORD OTOSAN",30026,11,null,1,"800M-1-1",{"$f":"IF(ISERROR(VLOOKUP(J8,#REF!,2,0)),\"\",(VLOOKUP(J8,#REF!,2,0)))","v":""},{"$f":"IF(ISERROR(VLOOKUP(J8,#REF!,4,0)),\"\",(VLOOKUP(J8,#REF!,4,0)))","v":""},{"$f":"IF(ISERROR(VLOOKUP(J8,#REF!,5,0)),\"\",(VLOOKUP(J8,#REF!,5,0)))","v":""}]
{"$rows_left_out":35}
{"sheet":"3000m.","index":8,"n_rows":64,"n_cols":17,"rows_kept":64,"cut":false,"hidden":false,"merged":[[5,3,6,3],[5,4,6,4],[2,13,2,16],[2,8,2,10],[5,0,6,0],[5,1,6,1],[3,0,3,2],[3,3,3,4],[3,13,3,16],[4,13,4,16],[5,6,6,6],[5,5,6,5],[5,2,6,2],[0,0,0,16],[1,0,1,16],[2,0,2,2],[2,3,2,4],[2,5,2,6]]}
[]
[{"$f":"'YARIŞMA BİLGİLERİ'!F19","v":"KOÇ TOPLULUĞU SPOR ŞENLİĞİ PUANLI ATLETİZM YARIŞLARI"}]
["Yarışma :",null,null,"3000 Metre",null,null,null,":"]
["Kategori :",null,null,{"$f":"'YARIŞMA BİLGİLERİ'!F21","v":"Kadınlar"},null,null,null,null,null,null,null,null,"Tarih-Saat ",{"$f":"'YARIŞMA PROGRAMI'!B12","v":"2017-04-15T10:45:00"}]
[null,null,null,null,null,null,null,null,null,null,null,null,null,{"$f":"NOW()","v":42842.612082291664}]
["Sıra No","Göğüs No","Doğum Tarihi\nGün/Ay/Yıl","Adı ve Soyadı","TAKIMI","Derece","Puan",null,"1. SERİ"]
[null,null,null,null,null,null,null,null,"Sıra No","Formül","Göğüs No","Doğum Tarihi","Adı ve Soyadı","TAKIMI","Elektronik Kronometre","El Kronometre","Seri Geliş"]
[1,null,null,"FADİME ÖZKAN","FORD OTOSAN",131270,11,null,1,"2000M-1-1",{"$f":"IF(ISERROR(VLOOKUP(J8,#REF!,2,0)),\"\",(VLOOKUP(J8,#REF!,2,0)))","v":""},{"$f":"IF(ISERROR(VLOOKUP(J8,#REF!,4,0)),\"\",(VLOOKUP(J8,#REF!,4,0)))","v":""},{"$f":"IF(ISERROR(VLOOKUP(J8,#REF!,5,0)),\"\",(VLOOKUP(J8,#REF!,5,0)))","v":""},{"$f":"IF(ISERROR(VLOOKUP(J8,#REF!,6,0)),\"\",(VLOOKUP(J8,#REF!,6,0)))","v":""}]
{"$rows_left_out":57}
{"sheet":"Yüksek","index":9,"n_rows":34,"n_cols":35,"rows_kept":34,"cut":false,"hidden":false,"merged":[[5,32,6,32],[5,1,6,1],[2,14,2,15],[5,3,6,3],[5,4,6,4],[5,5,6,5],[3,4,3,5],[4,32,4,34],[5,33,6,33],[5,34,6,34],[5,6,5,31],[3,0,3,3],[5,0,6,0],[3,32,3,34],[5,2,6,2],[0,0,0,34],[1,0,1,34],[2,0,2,3],[2,4,2,5],[2,20,2,23],[2,32,2,34]]}
[]
[{"$f":"'YARIŞMA BİLGİLERİ'!F19","v":"KOÇ TOPLULUĞU SPOR ŞENLİĞİ PUANLI ATLETİZM YARIŞLARI"}]
["Yarışma :",null,null,null,{"$f":"'YARIŞMA PROGRAMI'!C10","v":"Yüksek  Atlama"}]
["Kategori : ",null,null,null,{"$f":"'YARIŞMA BİLGİLERİ'!F21","v":"Kadınlar"},null,null,null,null,null,null,null,null,null,null,null,null,null,null,null,null,null,null,null,null,null,null,null,null,null,null,null,{"$f":"'YARIŞMA PROGRAMI'!B10","v":"15 Nisan 2017 - 10:15"}]
[null,null,null,null,null,null,null,null,null,null,null,null,null,null,null,null,null,null,null,null,null,null,null,null,null,null,null,null,null,null,null,null,{"$f":"NOW()","v":42842.612082291664}]
["SIRA NO",null,"GÖĞÜS NO","DOĞUM TARİHİ","ADI VE SOYADI","OKULU","A  T  L  A  M  A  L  A  R",null,null,null,null,null,null,null,null,null,null,null,null,null,null,null,null,null,null,null,null,null,null,null,null,null,"SONUÇ","PUAN","KLASMAN"]
[null,null,null,null,null,null,90,95,100,105,110,115,118,121,124,127,130,133,null,null,null,null,null,null,null,null,198,null,null,null,null,213]
[1,"Yüksek-24",{"$f":"IF(ISERROR(VLOOKUP(B8,#REF!,2,0)),\"\",(VLOOKUP(B8,#REF!,2,0)))","v":""},{"$f":"IF(ISERROR(VLOOKUP(B8,#REF!,4,0)),\"\",(VLOOKUP(B8,#REF!,4,0)))","v":""},"CANAN FİL","FORD OTOSAN","O","O","-","-","O","O","O","O","O","O","XO","Xr",null,null,null,null,null,null,null,null,null,null,null,null,null,null,130,11,4]
{"$rows_left_out":27}
{"sheet":"Uzun","index":10,"n_rows":42,"n_cols":13,"rows_kept":42,"cut":false,"hidden":false,"merged":[[5,12,6,12],[5,0,6,0],[41,6,41,9],[5,5,6,5],[41,10,41,11],[41,0,41,3],[5,2,6,2],[5,10,6,10],[5,1,6,1],[5,11,6,11],[5,3,6,3],[5,4,6,4],[5,6,5,9],[0,0,0,12],[1,0,1,12],[4,10,4,11],[2,3,2,4],[3,0,3,2],[3,9,3,11],[2,0,2,2],[3,3,3,4]]}
[]
[{"$f":"'YARIŞMA BİLGİLERİ'!F19","v":"KOÇ TOPLULUĞU SPOR ŞENLİĞİ PUANLI ATLETİZM YARIŞLARI"}]
["Yarışma :",null,null,{"$f":"'YARIŞMA PROGRAMI'!C13","v":"Uzun Atlama"}]
["Kategori :      ",null,null,{"$f":"'YARIŞMA BİLGİLERİ'!F21","v":"Kadınlar"},null,null,null,null,"Tarih-Saat  :",{"$f":"'YARIŞMA PROGRAMI'!B13","v":"2017-04-15T10:15:00"}]
[null,null,null,null,null,null,null,null,null,null,{"$f":"NOW()","v":42842.612082291664}]
["SIRA NO",null,"GÖĞÜS NO","DOĞUM TARİHİ\nGün/Ay/Yıl","ADI VE SOYADI","TAKIMI","A  T  L A M  A  L  A  R",null,null,null,"SONUÇ","PUAN","RÜZGAR"]
[null,null,null,null,null,null,1,2,3,4]
[1,"UZUN-3",{"$f":"IF(ISERROR(VLOOKUP(B8,#REF!,2,0)),\"\",(VLOOKUP(B8,#REF!,2,0)))","v":""},{"$f":"IF(ISERROR(VLOOKUP(B8,#REF!,4,0)),\"\",(VLOOKUP(B8,#REF!,4,0)))","v":""},"CANAN FİL","FORD OTOSAN",397,502,null,null,{"$f":"MAX(G8:J8)","v":502},11]
{"$rows_left_out":35}
{"sheet":"Gülle","index":11,"n_rows":27,"n_cols":13,"rows_kept":27,"cut":false,"hidden":false,"merged":[[5,1,6,1],[26,0,26,3],[26,6,26,9],[26,10,26,11],[4,10,4,11],[5,6,5,9],[5,3,6,3],[3,7,3,8],[5,12,6,12],[0,0,0,12],[1,0,1,12],[5,11,6,11],[5,0,6,0],[3,0,3,2],[3,3,3,4],[5,4,6,4],[5,10,6,10],[5,5,6,5],[2,0,2,2],[2,3,2,4],[3,9,3,11],[2,6,2,7],[5,2,6,2]]}
[]
[{"$f":"'YARIŞMA BİLGİLERİ'!F19","v":"KOÇ TOPLULUĞU SPOR ŞENLİĞİ PUANLI ATLETİZM YARIŞLARI"}]
["Yarışma :",null,null,"Gülle Atma"]
["Kategori :      ",null,null,{"$f":"'YARIŞMA BİLGİLERİ'!F21","v":"Kadınlar"},null,null,null,"Tarih-Saat  :",null,{"$f":"'YARIŞMA PROGRAMI'!B14","v":"2017-04-15T10:15:00"}]
[null,null,null,null,null,null,null,null,null,null,{"$f":"NOW()","v":42842.612082291664}]
["SIRA NO",null,"GÖĞÜS NO","DOĞUM TARİHİ\nGün/Ay/Yıl","ADI VE SOYADI","TAKIMI","A  T M  A  L  A  R",null,null,null,"SONUÇ","PUAN","KLASMAN"]
[null,null,null,null,null,null,1,2,3,4]
[1,"GÜLLE-4",{"$f":"IF(ISERROR(VLOOKUP(B8,#REF!,2,0)),\"\",(VLOOKUP(B8,#REF!,2,0)))","v":""},{"$f":"IF(ISERROR(VLOOKUP(B8,#REF!,4,0)),\"\",(VLOOKUP(B8,#REF!,4,0)))","v":""},"SEVCAN BALCI BEYPINAR","FORD OTOSAN",971,955,995,973,995,11]
{"$rows_left_out":20}
{"sheet":"4x100m.","index":12,"n_rows":37,"n_cols":17,"rows_kept":37,"cut":false,"hidden":false,"merged":[[0,0,0,16],[1,0,1,16],[2,0,2,2],[2,3,2,4],[2,5,2,6],[5,2,6,2],[2,13,2,16],[25,8,25,16],[5,6,6,6],[5,8,5,16],[15,8,15,16],[3,0,3,2],[3,3,3,4],[3,13,3,16],[5,0,6,0],[5,1,6,1],[2,8,2,11],[5,3,6,3],[5,4,6,4],[5,5,6,5],[4,13,4,16]]}
[]
[{"$f":"'YARIŞMA BİLGİLERİ'!F19","v":"KOÇ TOPLULUĞU SPOR ŞENLİĞİ PUANLI ATLETİZM YARIŞLARI"}]
["Yarışma :",null,null,{"$f":"'YARIŞMA PROGRAMI'!C16","v":"4x100 Metre"},null,null,null,null,{"$f":"'YARIŞMA PROGRAMI'!D16","v":0}]
["Kategori :",null,null,{"$f":"'YARIŞMA BİLGİLERİ'!F21","v":"Kadınlar"},null,null,null,null,null,null,null,null,"Tarih-Saat :",{"$f":"'YARIŞMA PROGRAMI'!B16","v":"2017-04-15T15:30:00"}]
[null,null,null,null,null,null,null,null,null,null,null,null,null,{"$f":"NOW()","v":42842.612082291664}]
["Sıra No","Göğüs No","Doğum Tarihi\nGün/Ay/Yıl","Adı ve Soyadı","TAKIMI","Derece","Puan",null,"1. SERİ"]
[null,null,null,null,null,null,null,null,"Kulvar","Formül","Göğüs No","Doğum Tarihi","Adı ve Soyadı","Takımı","Elektronik Kronometre","El Kronometre","Seri Geliş"]
[1,null,null,"SEMA KUNUK                   CANAN FİL                        FADİME ÖZKAN                  JALE YENGİNER","FORD OTOSAN",10132,11,null,1,"4X100M-1-1",{"$f":"IF(ISERROR(VLOOKUP(J8,#REF!,2,0)),\"\",(VLOOKUP(J8,#REF!,2,0)))","v":""},{"$f":"IF(ISERROR(VLOOKUP(J8,#REF!,4,0)),\"\",(VLOOKUP(J8,#REF!,4,0)))","v":""}]
{"$rows_left_out":30}
{"sheet":"İsveç","index":13,"n_rows":37,"n_cols":17,"rows_kept":37,"cut":false,"hidden":false,"merged":[[5,6,6,6],[5,8,5,16],[15,8,15,16],[25,8,25,16],[3,0,3,2],[3,3,3,4],[3,13,3,16],[4,13,4,16],[5,0,6,0],[5,1,6,1],[5,2,6,2],[5,3,6,3],[5,4,6,4],[5,5,6,5],[0,0,0,16],[1,0,1,16],[2,0,2,2],[2,3,2,4],[2,5,2,6],[2,8,2,11],[2,13,2,16]]}
[]
[{"$f":"'YARIŞMA BİLGİLERİ'!F19","v":"KOÇ TOPLULUĞU SPOR ŞENLİĞİ PUANLI ATLETİZM YARIŞLARI"}]
["Yarışma :",null,null,{"$f":"'YARIŞMA PROGRAMI'!C17","v":"İsveç Bayrak"},null,null,null,null,{"$f":"'YARIŞMA PROGRAMI'!D16","v":0}]
["Kategori :",null,null,{"$f":"'YARIŞMA BİLGİLERİ'!F21","v":"Kadınlar"},null,null,null,null,null,null,null,null,"Tarih-Saat :",{"$f":"'YARIŞMA PROGRAMI'!B16","v":"2017-04-15T15:30:00"}]
[null,null,null,null,null,null,null,null,null,null,null,null,null,{"$f":"NOW()","v":42842.612082291664}]
["Sıra No","Göğüs No","Doğum Tarihi\nGün/Ay/Yıl","Adı ve Soyadı","TAKIMI","Derece","Puan",null,"1. SERİ"]
[null,null,null,null,null,null,null,null,"Kulvar","Formül","Göğüs No","Doğum Tarihi","Adı ve Soyadı","Takımı","Elektronik Kronometre","El Kronometre","Seri Geliş"]
[1,null,null,"CANAN FİL                          İNCİ ÖZDEMİR                     FADİME ÖZKAN                 JALE YEĞİNER","FORD OTOSAN",25823,11,null,1,"4X100M-1-1",{"$f":"IF(ISERROR(VLOOKUP(J8,#REF!,2,0)),\"\",(VLOOKUP(J8,#REF!,2,0)))","v":""},{"$f":"IF(ISERROR(VLOOKUP(J8,#REF!,4,0)),\"\",(VLOOKUP(J8,#REF!,4,0)))","v":""},"MERVE AKIN                      AYŞEGÜL BAYRAK             DEMET OĞUZTÜRK            CEREN ANGILI","YAPI KREDİ",31848,null,3]
{"$rows_left_out":30}
{"sheet":"Genel Puan Tablosu","index":14,"n_rows":22,"n_cols":24,"rows_kept":22,"cut":false,"hidden":false,"merged":[[5,23,6,23],[4,16,4,23],[1,0,1,23],[2,0,2,23],[3,0,3,23],[5,0,6,0],[5,1,6,1],[5,7,5,8],[5,3,5,4],[4,13,4,15],[5,9,5,10],[5,5,5,6],[5,2,6,2],[5,13,5,14],[5,15,5,16],[5,17,5,18],[5,19,5,20],[5,21,5,22],[25,5,25,6],[25,9,25,10],[5,11,5,12],[23,0,23,15],[24,0,24,15],[25,1,26,1],[25,13,26,13],[25,3,25,4],[25,7,25,8],[25,11,25,12],[25,15,26,15],[25,14,26,14],[25,0,26,0],[25,2,26,2]]}
[]
[{"$f":"'YARIŞMA BİLGİLERİ'!F19","v":"KOÇ TOPLULUĞU SPOR ŞENLİĞİ PUANLI ATLETİZM YARIŞLARI"}]
["GENEL PUAN TABLOSU "]
[{"$f":"'YARIŞMA BİLGİLERİ'!F21","v":"Kadınlar"}]
[null,null,null,null,null,null,null,null,null,null,null,null,null,{"$f":"'YARIŞMA PROGRAMI'!B18","v":"2017-04-15T15:30:00"}]
["SIRA","TAKIMI",null,"100 METRE",null,"200 METRE",null,"800 METRE",null,"YÜKSEK ATLAMA",null,"GÜLLE ATMA",null,"UZUN ATLAMA",null,"3000 METRE",null,"400 METRE",null,"4X100 METRE",null,"İSVEÇ BAYRAK",null,"GENEL PUAN"]
[null,null,null,"DERECE","PUAN","DERECE","PUAN","DERECE","PUAN","DERECE","PUAN","DERECE","PUAN","DERECE","PUAN","DERECE","PUAN","DERECE","PUAN","DERECE","PUAN","DERECE","PUAN"]
[1,"FORD OTOSAN",null,{"$f":"VLOOKUP(B8,'100m.'!E:F,2,0)","v":1425},{"$f":"VLOOKUP(B8,'100m.'!E:G,3,0)","v":11},{"$f":"VLOOKUP(B8,'200m.'!E:F,2,0)","v":3365},{"$f":"VLOOKUP(B8,'200m.'!E:G,3,0)","v":11},{"$f":"VLOOKUP(B8,'800m.'!E:F,2,0)","v":30026},{"$f":"VLOOKUP(B8,'800m.'!E:G,3,0)","v":11},130,11,995,11,502,11,{"$f":"VLOOKUP(B8,'3000m.'!E:F,2,0)","v":131270},{"$f":"VLOOKUP(B8,'3000m.'!E:G,3,0)","v":11},{"$f":"VLOOKUP(B8,'400m.'!E:F,2,0)","v":11460},{"$f":"VLOOKUP(B8,'400m.'!E:G,3,0)","v":11},{"$f":"VLOOKUP(B8,'4x100m.'!E:F,2,0)","v":10132},{"$f":"VLOOKUP(B8,'4x100m.'!E:G,3,0)","v":11},25823,11,{"$f":"SUM(E8,G8,I8,K8,M8,O8,Q8,S8,U8,W8)","v":110}]
{"$rows_left_out":14}