{"text_format":"1","workbook":"xlsx","n_sheets":15,"sheets":["YARIŞMA BİLGİLERİ","YARIŞMA PROGRAMI","PUAN","100m.","200m.","400m.","100m. Final","800m.","3000m.","Yüksek","Uzun","Gülle","4x100m.","İsveç","Genel Puan Tablosu"],"not_rendered":{"charts":0,"images":14,"macros":1,"external_links":0,"defined_names":210,"comments":0,"pivot_tables":0},"unopened":[],"bounds":{"document_bytes":16777216,"sheet_cells":100000,"rows_first":2000,"rows_last":500,"rows_between":2000,"halvings":0,"cell_chars":16384,"cell_head_chars":4096},"cells_cut":0,"cells_raw":0,"read":"whole","date_system":"1900"}

{"sheet":"YARIŞMA BİLGİLERİ","index":0,"n_rows":24,"n_cols":6,"rows_kept":24,"cut":false,"hidden":false,"merged":[[26,0,26,10],[24,0,24,10],[18,0,18,4],[19,0,19,4],[20,0,20,4],[21,0,21,4],[22,0,22,4],[1,0,1,10],[12,0,12,10],[14,0,14,10],[13,0,13,10],[23,0,23,4],[18,5,18,10],[19,5,19,10],[17,0,17,10],[11,0,11,10],[16,0,16,10],[20,5,20,10],[21,5,21,10]]}
[]
[]
[]
[]
[]
[]
[]
[]
[]
[]
[]
[]
[]
[]
[]
[]
[]
["Yarışma Bilgileri"]
["Yarışma Adı :",null,null,null,null,"KOÇ TOPLULUĞU SPOR ŞENLİĞİ PUANLI ATLETİZM YARIŞLARI"]
["Yarışmanın Yapıldığı İl :",null,null,null,null,"İstanbul"]
["Kategori :",null,null,null,null,"Kadınlar"]
["Tarih :",null,null,null,null,"2017-04-15"]
["Katılan Sporcu Sayısı :"]
["Katılan Takım Sayısı :"]

{"sheet":"YARIŞMA PROGRAMI","index":1,"n_rows":22,"n_cols":8,"rows_kept":22,"cut":false,"hidden":false,"merged":[[8,2,8,3],[9,2,9,3],[15,2,15,3],[16,2,16,3],[17,2,17,3],[10,2,10,3],[11,2,11,3],[12,2,12,3],[13,2,13,3],[14,2,14,3],[5,2,5,4],[6,2,6,3],[7,2,7,3],[0,7,2,7],[2,1,2,4],[1,1,1,4],[3,1,3,4],[4,1,4,4]]}
[null,null,null,null,null,null,null,"Diskalifiye Nedenleri ve Kural Numaraları"]
[null,{"$f":"'YARIŞMA BİLGİLERİ'!F19","v":"KOÇ TOPLULUĞU SPOR ŞENLİĞİ PUANLI ATLETİZM YARIŞLARI"}]
[null,"YARIŞMA PROGRAMI"]
[null,"Bakmak istediğiniz branş üzerine \"Tıkla\"yınız…",null,null,null,null,null,"KURAL 125.5 : Yarışmalar esnasında sportmenlik dışı davranışlarda bulunan sporcu IAAF Kural 125.5 gereği diskalifiye edilecektir. Sporcunun yarışmanın devamındaki diğer branşlara katılması da engellenecektir. “Bu kurala göre diskalifiye edilen atletin, diskalifiye edildiği yarıştaki dereceleri geçersizdir.” Yarışma sonucunda o atletin karşısında sadece “DQ 125.5” yazacak. Tüm uyarılar ve diskalifikasyonlar (yani sarı ve kırmızı kartlar) yarışma sekreterliğine ve tüm başhakemlere bildirilecektir."]
[null,{"$f":"'YARIŞMA BİLGİLERİ'!F21","v":"Kadınlar"},null,null,null,null,null,"KURAL 144.2 : Yarışma sırasında kurallar dışında yardım alan veya yardım veren atlet, başhakem tarafından önce sarı kartla uyarılır, tekrarı halinde IAAF Kural 144.2’ye göre diskalifiye edilir. Yarışma alanında telefon, telsiz, radyo, kasetçalar vb. cihazlar kullanılması, atlete avantaj sağlayacak şekilde yay, tekerlek vb. donanıma sahip ayakkabıların giyilmesi, atma aletlerinin normal ölçülerine eklerin yapılması, “kural dışı yardım” kabul edilir. Mesafe koşularında tur yemiş ya da tur yemek üzere olan atletlerin tempo vermesi, IAAF Kural 144.2 çerçevesinde her iki atletin de diskalifiye edilmesini gerektirir.  "]
[null,"SAAT","BRANŞ",null,null,null,null,"KURAL 162.5 :Yerlerinize ya da dikkat komutundan sonra makul bir sürede pozisyon almayan ve yerlerinize komutundan sonra sesle ya da başka şekilde diğer atlet(ler)i rahatsız eden atlet(ler) önce sarı kart, tekrarı halinde kırmızı kart görür.” Eğer başhakem, starterin kararıyla mutabık değilse, tüm atletlere yeşil kart gösterilir. Bu kural sadece starteri/start başhakemini ilgilendirir."]
[null,"2017-04-15T11:10:00","100 Metre",null," ",null,null,"KURAL 162.7 : Hatalı çıkış yapan her atlet diskalifiye edilir. Yarışmada ilk hatalı çıkışı yapan sporcu dahil, hatalı çıkış yapan tüm atletler IAAF Kural 162.7 gereği diskalifiye edilecektir."]
[null,"15 Nisan 2017 - 12:45","200 Metre",null," ",null,null,"KURAL 163.2 : Yarışma içerisinde bir sporcunun iterek veya çelme takarak, kasıtlı olarak bir başka sporcunun düşmesine neden olması diskalifiye sebebidir. Bunu yapan sporcu IAAF Kural 163.2 gereği diskalifiye edilecektir. (Bu tip olaylarda yardımcı hakem sarı bayrağını kaldıracak ve başhakemi bilgilendirecektir. Diskalifiye olup olmayacağına başhakem karar verecektir.) "]
[null,"2017-04-15T15:15:00","800 Metre",null," ",null,null,"KURAL 163.3 : Kulvarlı koşuların tamamında sporcu, yarışmayı çıkıştan varışa kadar kendi kulvarında koşmak zorundadır. Virajda kendi kulvarının solundaki kulvara geçen ya da o kulvarın çizgisine temas eden atlet, IAAF Kural 163.3 gereği diskalifiye edilecektir. Ancak sporcu yarışma içerisinde başkası tarafından itilmek veya dengesinin bozulması sonucu kulvar değiştirmek zorunda kalırsa ve  bu durum kendisine avantaj sağlamazsa diskalifiye söz konusu olmayacaktır. Düzlükte kendi kulvarının dışına çıkan ve kendisine mesafe avantajı sağlamayan atlet, bir diğer kulvardaki atleti engellememişse diskalifiye edilmez. Virajda kendi kulvarının sağındaki kulvara geçen ya da o kulvarın çizgisiyle temas eden atlet, o kulvarda koşan atleti engellememişse diskalifiye edilmez."]
[null,"15 Nisan 2017 - 10:15","Yüksek  Atlama",null," ",null,null,"KURAL 163.3 : 800 metre koşusunda sporcular kendi kulvarlarını terk edecekleri çizgiye kadar, kulvarlarında koşmak zorundadır. Bu işaretli bölüme gelmeden kulvarını terk eden sporcu IAAF Kural 163.3 gereği diskalifiye edilecektir."]
[null,"2017-04-15T12:15:00","400 Metre",null," ",null,null,"KURAL 163.3 : 4*400 metre bayrak yarışmasında ikinci sıradaki sporcu kulvar farkı sona erinceye kadar (ilk dönemeç) kendi kulvarında koşacaktır. Bu noktaya gelene kadar kulvar ihlali yapan sporcunun takımı IAAF Kural 163.3 gereği diskalifiye edilecektir"]
[null,"2017-04-15T10:45:00","3000 Metre",null," ",null,null,"KURAL 168.7 : Engel yarışmalarında engel geçişi esnasında ayağını engelin üst kısmının yatay düzeyinin aşağısından geçiren, eli veya ayağı ile engeli kasten deviren ve her ne sebeple olursa olsun engel üzerinden geçmeyen sporcu IAAF Kural 168.7 gereği diskalifiye edilecektir."]
[null,"2017-04-15T10:15:00","Uzun Atlama",null," ",null,null,"KURAL 170.9 : 4*400 metre bayrak yarışmasında 3. ve 4. sporcular; kendilerinden önceki takım elemanlarının 200 metreyi geçiş durumuna göre sıralanacaklar ve bu sıralamayı bayrak değişim anına kadar değiştirdikleri takdirde takımları IAAF Kural 170.9 gereği diskalifiye edilecektir."]
[null,"2017-04-15T10:15:00","Gülle Atma",null," ",null,null,"KURAL 170.13 : Bayrak yarışmalarında bayrağın yere düşmesi halinde, bayrağı düşüren atlet alacaktır. Bayrağı düşüren atletin dışında bir atletin alması, IAAF Kural 170.13’e göre takımın diskalifiye edilmesine neden olur. Bayrağı düşüren atlet, bayrağı yerden alırken koşulan mesafeyi kısaltır ya da bir başka kulvardaki atleti engellerse, yine bu kural çerçevesinde takımı diskalifiye edilir."]
[null,"15 Nisan 2017 - 14:14","100 Metre Final",null,null,null,null,"KURAL 170.14 : Bayrak yarışmalarında bayrağın değişim sahasının dışında değiştirilmesi durumunda hatalı değişimi yapan takım IAAF Kural 170.14 gereği diskalifiye edilecektir. Bu noktada dikkat edilmesi gereken en önemli husus sporcunun değil, bayrağın değişim alanı içerisinde olmasıdır."]
[null,"2017-04-15T15:30:00","4x100 Metre",null," "]
[null,"2017-04-15T14:45:00","İsveç Bayrak"]
[null,"2017-04-15T15:30:00","Genel Puan Durumu",null,null,null,null,"Uluslararası kısaltmalar"]
[null,null,null,null,null,null,null,"DNS   : Yarışa başlamadı"]
[null,null,null,null,null,null,null,"DNF  : Yarışı tamamlamadı"]
[null,null,null,null,null,null,null,"DQ    : Diskalifiye"]
[null,null,null,null,null,null,null,"NM   : Geçerli derecesi yok"]

{"sheet":"PUAN","index":2,"n_rows":109,"n_cols":32,"rows_kept":109,"cut":false,"hidden":true,"merged":[[0,0,0,31],[1,24,1,27],[1,28,1,30],[1,31,3,31],[1,20,1,22],[1,0,1,18],[1,23,2,23]]}
["GENÇ VE YILDIZ ERKEKLER PUAN TABLOSU"]
["KOŞULAR",null,null,null,null,null,null,null,null,null,null,null,null,null,null,null,null,null,null,null,"BAYRAK",null,null,"PUAN","ATLAMALAR",null,null,null,"ATMALAR",null,null,"PUAN"]
["100m",null,"200m","PUAN","300m\nYıldız","PUAN","400m","PUAN","100 m H\n110m H","PUAN","300m H","PUAN","800m","PUAN","1500m","PUAN","2000m\nYıldız","PUAN","3000m","PUAN","4X100M\nYıldız","PUAN","İsveç \nBayrak",null,"Yüksek","Uzun","Üçadım","Sırık","Gülle","Disk","Cirit"]
["DERECE",null,"DERECE",null,"DERECE",null,"DERECE",null,"DERECE",null,"DERECE",null,"DERECE",null,"DERECE",null,"DERECE",null,"DERECE",null,"DERECE",null,"DERECE",null,"DERECE","DERECE","DERECE","DERECE","DERECE","DERECE","DERECE"]
[null,null,null,null,null,null,null,null,null,null,null,null,null,null,null,null,null,null,null,null,null,null,null,null,1,1,1,1,1,1,1,0]
[1040,null,2089,100,3600,100,4644,100,1380,100,3614,100,14824,100,34624,100,54524,100,81024,100,4764,100,15624,100,98,310,760,130,430,1000,1000,1]
[1042,null,2094,99,3620,99,4654,99,1384,99,3619,99,14844,99,34654,99,54624,99,81124,99,4774,99,15654,99,100,317,754,140,447,1060,1120,2]
[1044,null,2099,98,3640,98,4664,98,1388,98,3624,98,14864,98,34684,98,54724,98,81224,98,4784,98,15684,98,102,324,768,145,464,1120,1200,3]
[1046,null,2104,97,3660,97,4674,97,1392,97,3629,97,14884,97,34714,97,54824,97,81324,97,4794,97,15714,97,104,331,782,150,481,1180,1280,4]
[1048,null,2109,96,3680,96,4684,96,1396,96,3634,96,14904,96,34744,96,54924,96,81424,96,4804,96,15744,96,106,338,796,155,498,1240,1360,5]
[1050,null,2114,95,3700,95,4694,95,1400,95,3639,95,14924,95,34774,95,55024,95,81524,95,4814,95,15774,95,108,345,808,160,515,1300,1440,6]
[1052,null,2119,94,3720,94,4704,94,1404,94,3644,94,14944,94,34814,94,55124,94,81624,94,4824,94,15804,94,110,352,822,165,532,1360,1520,7]
[1054,null,2124,93,3740,93,4714,93,1408,93,3649,93,14964,93,34854,93,55224,93,81724,93,4834,93,15834,93,112,359,836,170,548,1420,1600,8]
[1056,null,2129,92,3760,92,4724,92,1412,92,3654,92,14984,92,34894,92,55324,92,81824,92,4844,92,15864,92,114,366,848,175,564,1480,1680,9]
[1058,null,2134,91,3780,91,4734,91,1416,91,3659,91,15004,91,34934,91,55424,91,81924,91,4854,91,15894,91,116,373,860,180,580,1540,1750,10]
[1060,null,2139,90,3800,90,4744,90,1420,90,3664,90,15034,90,34974,90,55524,90,82024,90,4864,90,15924,90,118,380,872,185,596,1600,1820,11]
[1062,null,2144,89,3820,89,4754,89,1424,89,3674,89,15064,89,35024,89,55624,89,82124,89,4874,89,15954,89,120,387,884,190,612,1650,1890,12]
[1064,null,2149,88,3840,88,4764,88,1428,88,3684,88,15094,88,35074,88,55724,88,82224,88,4884,88,15984,88,122,394,896,195,628,1700,1960,13]
[1066,null,2154,87,3860,87,4774,87,1432,87,3694,87,15124,87,35124,87,55824,87,82324,87,4894,87,20014,87,124,401,908,200,644,1750,2030,14]
[1068,null,2159,86,3880,86,4784,86,1436,86,3704,86,15154,86,35174,86,55924,86,82424,86,4914,86,20044,86,126,408,920,205,660,1800,2100,15]
[1070,null,2164,85,3900,85,4794,85,1440,85,3714,85,15184,85,35224,85,60024,85,82524,85,4934,85,20074,85,128,415,932,210,676,1850,2170,16]
[1072,null,2169,84,3920,84,4804,84,1444,84,3724,84,15214,84,35274,84,60124,84,82624,84,4954,84,20104,84,130,422,944,215,692,1900,2240,17]
[1074,null,2174,83,3940,83,4814,83,1449,83,3734,83,15244,83,35324,83,60224,83,82824,83,4974,83,20134,83,132,429,956,220,708,1950,2310,18]
[1076,null,2179,82,3960,82,4824,82,1454,82,3744,82,15274,82,35374,82,60324,82,83024,82,4994,82,20164,82,134,436,968,225,724,2000,2380,19]
[1078,null,2184,81,3980,81,4834,81,1459,81,3754,81,15304,81,35424,81,60424,81,83224,81,5014,81,20204,81,136,443,980,230,740,2050,2450,20]
[1080,null,2189,80,4000,80,4844,80,1464,80,3764,80,15334,80,35484,80,60524,80,83424,80,5034,80,20234,80,138,450,992,234,756,2100,2520,21]
[1082,null,2194,79,4020,79,4854,79,1469,79,3774,79,15364,79,35544,79,60624,79,83624,79,5054,79,20264,79,140,456,1004,238,772,2150,2590,22]
[1084,null,2199,78,4040,78,4864,78,1474,78,3784,78,15394,78,35604,78,60724,78,83824,78,5074,78,20304,78,142,462,1016,242,788,2200,2660,23]
[1086,null,2204,77,4060,77,4874,77,1479,77,3794,77,15424,77,35664,77,60824,77,84024,77,5094,77,20344,77,144,468,1028,246,804,2250,2730,24]
[1088,null,2209,76,4080,76,4884,76,1484,76,3804,76,15454,76,35724,76,60924,76,84224,76,5114,76,20384,76,146,474,1040,250,820,2300,2800,25]
[1090,null,2214,75,4100,75,4894,75,1489,75,3814,75,15484,75,35784,75,61024,75,84424,75,5134,75,20424,75,148,480,1049,254,836,2325,2855,26]
[1093,null,2219,74,4120,74,4914,74,1494,74,3829,74,15524,74,35884,74,61124,74,84624,74,5154,74,20464,74,150,486,1058,258,852,2350,2890,27]
[1096,null,2224,73,4140,73,4934,73,1499,73,3844,73,15564,73,35984,73,61224,73,84824,73,5174,73,20504,73,152,492,1067,262,868,2400,2960,28]
[1099,null,2234,72,4160,72,4954,72,1504,72,3859,72,15604,72,40084,72,61324,72,85024,72,5194,72,20544,72,154,498,1076,266,884,2450,3030,29]
[1102,null,2244,71,4180,71,4974,71,1509,71,3874,71,15644,71,40184,71,61424,71,85224,71,5214,71,20584,71,156,504,1085,270,900,2500,3100,30]
[1105,null,2254,70,4200,70,4994,70,1514,70,3889,70,15694,70,40284,70,61524,70,85424,70,5234,70,20624,70,157,510,1094,274,916,2550,3170,31]
[1108,null,2264,69,4220,69,5014,69,1519,69,3904,69,15744,69,40384,69,61624,69,85624,69,5254,69,20664,69,158,516,1103,278,932,2600,3240,32]
[1111,null,2274,68,4240,68,5034,68,1524,68,3919,68,15794,68,40484,68,61724,68,85824,68,5274,68,20704,68,159,521,1112,282,948,2650,3310,33]
[1114,null,2284,67,4260,67,5054,67,1529,67,3934,67,15844,67,40584,67,61824,67,90024,67,5294,67,20744,67,160,526,1121,286,964,2700,3380,34]
[1117,null,2294,66,4280,66,5074,66,1534,66,3949,66,15894,66,40684,66,61924,66,90224,66,5314,66,20784,66,161,531,1130,290,980,2750,3450,35]
[1120,null,2304,65,4300,65,5094,65,1539,65,3964,65,15944,65,40784,65,62024,65,90424,65,5334,65,20824,65,162,536,1139,294,995,2800,3520,36]
[1123,null,2314,64,4310,64,5114,64,1544,64,3979,64,15994,64,40884,64,62124,64,90624,64,5354,64,20864,64,163,541,1148,298,1010,2850,3590,37]
[1126,null,2324,63,4320,63,5134,63,1554,63,3994,63,20244,63,40984,63,62224,63,90824,63,5374,63,20904,63,164,546,1157,302,1025,2900,3660,38]
[1129,null,2334,62,4330,62,5154,62,1564,62,4009,62,20104,62,41084,62,62324,62,91024,62,5394,62,20944,62,165,551,1166,306,1040,2950,3730,39]
[1132,null,2344,61,4340,61,5174,61,1574,61,4024,61,20164,61,41184,61,62424,61,91224,61,5424,61,20984,61,166,556,1175,310,1055,3000,3800,40]
[1135,null,2354,60,4350,60,5194,60,1584,60,4039,60,20224,60,41284,60,62524,60,91424,60,5454,60,21024,60,167,560,1184,314,1070,3050,3870,41]
[1139,null,2364,59,4360,59,5214,59,1594,59,4054,59,20284,59,41384,59,62624,59,91624,59,5484,59,21064,59,168,564,1193,318,1085,3100,3940,42]
[1143,null,2374,58,4370,58,5234,58,1604,58,4074,58,20344,58,41484,58,62724,58,91824,58,5514,58,21104,58,169,568,1202,322,1100,3150,4010,43]
[1147,null,2384,57,4380,57,5254,57,1614,57,4094,57,20404,57,41584,57,62824,57,92024,57,5544,57,21144,57,170,572,1211,326,1115,3200,4080,44]
[1151,null,2394,56,4390,56,5274,56,1624,56,4114,56,20464,56,41684,56,62924,56,92224,56,5574,56,21184,56,171,576,1220,330,1130,3250,4150,45]
[1155,null,2404,55,4400,55,5294,55,1634,55,4134,55,20524,55,41784,55,63024,55,92424,55,5604,55,21224,55,172,580,1229,334,1145,3300,4220,46]
[1159,null,2414,54,4410,54,5314,54,1644,54,4154,54,20584,54,41884,54,63124,54,92624,54,5634,54,21264,54,173,584,1238,338,1160,3350,4290,47]
[1164,null,2424,53,4420,53,5334,53,1654,53,4174,53,20644,53,41984,53,63224,53,92824,53,5664,53,21304,53,174,588,1247,342,1175,3400,4360,48]
[1169,null,2434,52,4430,52,5354,52,1664,52,4194,52,20704,52,42084,52,63324,52,93024,52,5694,52,21344,52,175,592,1256,346,1190,3450,4430,49]
[1174,null,2444,51,4440,51,5374,51,1674,51,4214,51,20764,51,42204,51,63424,51,93324,51,5724,51,21384,51,176,596,1265,350,1205,3500,4500,50]
[1179,null,2454,50,4450,50,5394,50,1684,50,4234,50,20824,50,42324,50,63524,50,93624,50,5754,50,21424,50,177,600,1273,354,1220,3550,4570,51]
[1184,null,2464,49,4460,49,5424,49,1694,49,4254,49,20904,49,42474,49,63624,49,93924,49,5784,49,21484,49,178,604,1281,358,1235,3600,4640,52]
[1189,null,2474,48,4470,48,5454,48,1704,48,4274,48,20984,48,42624,48,63724,48,94224,48,5824,48,21544,48,179,608,1289,362,1250,3650,4710,53]
[1194,null,2484,47,4480,47,5484,47,1714,47,4294,47,21064,47,42774,47,63824,47,94524,47,5864,47,21604,47,180,612,1297,366,1265,3700,4780,54]
[1199,null,2494,46,4490,46,5514,46,1724,46,4324,46,21144,46,42924,46,63924,46,94824,46,5904,46,21664,46,181,616,1305,370,1280,3750,4850,55]
[1204,null,2504,45,4500,45,5544,45,1734,45,4354,45,21224,45,43074,45,64024,45,95124,45,5944,45,21724,45,182,620,1313,374,1295,3800,4920,56]
[1209,null,2514,44,4510,44,5574,44,1744,44,4384,44,21304,44,43224,44,64124,44,95524,44,5984,44,21784,44,183,624,1321,378,1310,3850,4990,57]
[1214,null,2524,43,4520,43,5604,43,1754,43,4414,43,21404,43,43374,43,64224,43,95924,43,10024,43,21844,43,184,628,1329,382,1325,3900,5060,58]
[1219,null,2534,42,4530,42,5634,42,1764,42,4444,42,21504,42,43524,42,64324,42,100324,42,10064,42,21904,42,185,632,1337,386,1340,3950,5130,59]
[1224,null,2544,41,4540,41,5664,41,1774,41,4474,41,21604,41,43674,41,64424,41,100724,41,10104,41,21964,41,186,636,1345,390,1355,4000,5200,60]
[1229,null,2554,40,4550,40,5694,40,1784,40,4504,40,21704,40,43824,40,64524,40,101124,40,10144,40,22024,40,187,640,1352,393,1370,4040,5260,61]
[1234,null,2574,39,4560,39,5724,39,1794,39,4534,39,21804,39,44024,39,64624,39,101624,39,10184,39,22084,39,188,644,1359,396,1385,4080,5320,62]
[1244,null,2594,38,4570,38,5754,38,1804,38,4564,38,21904,38,44224,38,64724,38,102124,38,10224,38,22144,38,189,648,1366,399,1400,4120,5380,63]
[1254,null,2614,37,4580,37,5784,37,1814,37,4594,37,22004,37,44424,37,64824,37,102624,37,10264,37,22204,37,190,652,1373,402,1415,4160,5440,64]
[1264,null,2634,36,4590,36,5824,36,1824,36,4624,36,22124,36,44624,36,64924,36,103124,36,10314,36,22264,36,191,656,1380,405,1430,4200,5500,65]
[1274,null,2654,35,4600,35,5864,35,1844,35,4654,35,22244,35,44924,35,65024,35,103624,35,10364,35,22324,35,192,660,1387,408,1445,4240,5560,66]
[1284,null,2674,34,4610,34,5904,34,1864,34,4684,34,22364,34,45224,34,65124,34,104124,34,10414,34,22384,34,193,664,1394,411,1460,4280,5620,67]
[1294,null,2694,33,4620,33,5944,33,1884,33,4714,33,22484,33,45524,33,65224,33,104724,33,10464,33,22444,33,194,668,1401,414,1475,4320,5680,68]
[1304,null,2714,32,4630,32,5984,32,1904,32,4744,32,22604,32,45824,32,65324,32,105324,32,10514,32,22504,32,195,672,1408,417,1490,4360,5740,69]
[1314,null,2734,31,4640,31,10024,31,1924,31,4774,31,22724,31,50124,31,65424,31,105924,31,10564,31,22564,31,196,676,1415,420,1505,4400,5800,70]
[1324,null,2754,30,4650,30,10064,30,1944,30,4804,30,22874,30,50424,30,65524,30,110524,30,10624,30,22624,30,197,680,1422,423,1520,4440,5860,71]
[1334,null,2774,29,4660,29,10104,29,1964,29,4834,29,23024,29,50724,29,65624,29,111224,29,10684,29,22684,29,198,684,1429,426,1535,4480,5920,72]
[1344,null,2794,28,4670,28,10144,28,1984,28,4864,28,23174,28,51024,28,65724,28,111924,28,10744,28,22744,28,199,688,1436,429,1550,4520,5980,73]
[1354,null,2814,27,4680,27,10184,27,2004,27,4904,27,23324,27,51324,27,65824,27,112624,27,10804,27,22804,27,200,692,1443,432,1565,4560,6040,74]
[1364,null,2834,26,4690,26,10224,26,2024,26,4944,26,23474,26,51624,26,65924,26,113324,26,10864,26,22864,26,201,696,1450,435,1580,4600,6100,75]
[1374,null,2854,25,4700,25,10264,25,2044,25,4984,25,23624,25,51924,25,70024,25,114024,25,10924,25,22924,25,202,700,1456,438,1595,4640,6160,76]
[1384,null,2874,24,4710,24,10314,24,2064,24,5024,24,23824,24,52224,24,70124,24,114824,24,11004,24,23024,24,203,704,1462,441,1610,4680,6220,77]
[1394,null,2894,23,4720,23,10364,23,2084,23,5064,23,24024,23,52524,23,70224,23,115624,23,11084,23,23124,23,204,708,1468,444,1625,4720,6280,78]
[1404,null,2914,22,4730,22,10414,22,2104,22,5104,22,24224,22,52824,22,70324,22,120424,22,11164,22,23224,22,205,712,1474,447,1640,4760,6340,79]
[1414,null,2944,21,4740,21,10464,21,2124,21,5144,21,24424,21,53124,21,70424,21,121224,21,11244,21,23324,21,206,716,1480,450,1655,4800,6400,80]
[1424,null,2974,20,4750,20,10514,20,2144,20,5184,20,24624,20,53524,20,70524,20,122124,20,11324,20,23424,20,207,720,1486,453,1670,4840,6460,81]
[1434,null,3004,19,4760,19,10564,19,2164,19,5224,19,24824,19,53924,19,70624,19,123024,19,11404,19,23524,19,208,724,1492,456,1685,4880,6520,82]
[1444,null,3034,18,4770,18,10624,18,2184,18,5264,18,25024,18,54324,18,70724,18,123924,18,11504,18,23624,18,209,728,1498,459,1700,4920,6580,83]
[1454,null,3064,17,4780,17,10684,17,2204,17,5314,17,25224,17,54724,17,70824,17,124824,17,11604,17,23724,17,210,732,1504,462,1715,4960,6640,84]
[1464,null,3094,16,4790,16,10744,16,2224,16,5364,16,25424,16,55124,16,70924,16,125824,16,11704,16,23824,16,211,736,1510,465,1730,5000,6700,85]
[1474,null,3124,15,4800,15,10804,15,2244,15,5414,15,25624,15,55524,15,71024,15,130824,15,11804,15,23924,15,212,739,1516,468,1745,5040,6760,86]
[1484,null,3154,14,4810,14,10864,14,2264,14,5464,14,25824,14,55924,14,71124,14,131824,14,11904,14,24024,14,213,742,1522,471,1760,5080,6820,87]
[1494,null,3184,13,4820,13,10924,13,2284,13,5514,13,30024,13,60324,13,71224,13,132824,13,12004,13,24124,13,214,745,1528,474,1775,5120,6880,88]
[1504,null,3214,12,4830,12,11004,12,2304,12,5564,12,30224,12,60724,12,71324,12,133924,12,12030,12,24224,12,215,748,1534,477,1790,5160,6940,89]
[1524,null,3254,11,4840,11,11084,11,2324,11,5614,11,30524,11,61124,11,71424,11,135024,11,12040,11,24324,11,216,751,1540,480,1805,5200,7000,90]
[1544,null,3294,10,4850,10,11164,10,2354,10,5664,10,30824,10,61624,10,71524,10,140124,10,12054,10,24424,10,null,757,1552,486,1835,5280,7120,91]
[1564,null,3334,9,4860,9,11244,9,2384,9,5734,9,31124,9,62124,9,71624,9,141224,9,12074,9,24524,9,217,754,1546,483,1820,5240,7060,92]
[1584,null,3374,8,4870,8,11324,8,2414,8,5804,8,31424,8,62624,8,71724,8,142324,8,13000,8,24624,8,null,763,1564,492,1865,5360,7240,93]
[1604,null,3414,7,4880,7,11404,7,2444,7,5874,7,31724,7,63124,7,71824,7,143424,7,13010,7,24724,7,218,760,1558,489,1850,5320,7180,94]
[1624,null,3454,6,4890,6,11504,6,2474,6,5944,6,32024,6,63624,6,71924,6,144524,6,13040,6,24824,6,null,768,1576,498,1894,5440,7360,95]
[1644,null,3494,5,4900,5,11604,5,2504,5,10014,5,32324,5,64124,5,72024,5,145624,5,13050,5,24924,5,219,766,1570,495,1880,5400,7300,96]
[1664,null,3544,4,4910,4,11704,4,2544,4,10094,4,32624,4,64724,4,72124,4,150724,4,13104,4,25024,4,null,772,1588,504,1922,5520,7480,97]
[1684,null,3594,3,4920,3,11804,3,2584,3,10194,3,33024,3,65424,3,72224,3,151824,3,13114,3,25124,3,220,770,1582,501,1908,5480,7420,98]
[1704,null,3644,2,4930,2,11904,2,2624,2,10294,2,33524,2,70224,2,72324,2,152924,2,13130,2,25224,2,null,776,1600,510,1950,5600,7600,99]
[1724,null,3694,1,4940,1,12004,1,2664,1,10394,1,34024,1,71124,1,72424,1,153024,1,13140,1,25324,1,221,774,1594,507,1936,5560,7540,100]
["DNS",null,"DNS",0,"DNS",0,"DNS",0,"DNS",0,"DNS",0,"DNS",0,"DNS",0,"DNS",0,"DNS",0,"DNS",0,"DNS",0]
["DNF",null,"DNF",null,"DNF",0,"DNF",null,"DNF",null,"DNF",null,"DNF",null,"DNF",null,"DNF",null,"DNF",null,"DNF",null,"DNF",0]
["NM",null,"NM",null,"NM",0,"NM",null,"NM",null,"NM",null,"NM",null,"NM",null,"NM",null,"NM",null,"NM",null,"NM",0]
["DQ",null,"DQ",null,"DQ",0,"DQ",null,"DQ",null,"DQ",null,"DQ",null,"DQ",null,"DQ",null,"DQ",null,"DQ",null,"DQ",0]

{"sheet":"100m.","index":3,"n_rows":57,"n_cols":17,"rows_kept":57,"cut":false,"hidden":false,"merged":[[4,13,4,16],[2,13,2,16],[3,13,3,16],[5,5,6,5],[5,1,6,1],[5,2,6,2],[5,3,6,3],[2,8,2,10],[5,6,6,6],[3,0,3,2],[3,3,3,4],[5,0,6,0],[5,4,6,4],[0,0,0,16],[1,0,1,16],[2,0,2,2],[2,3,2,4],[2,5,2,6]]}
[]
[{"$f":"'YARIŞMA BİLGİLERİ'!F19","v":"KOÇ TOPLULUĞU SPOR ŞENLİĞİ PUANLI ATLETİZM YARIŞLARI"}]
["Yarışma :",null,null,{"$f":"'YARIŞMA PROGRAMI'!C15","v":"100 Metre Final"},null,null,null,":"]
["Kategori :",null,null,{"$f":"'YARIŞMA BİLGİLERİ'!F21","v":"Kadınlar"},null,null,null,null,null,null,null,null,"Tarih-Saat :",{"$f":"'YARIŞMA PROGRAMI'!B7","v":42840.465277777781}]
[null,null,null,null,null,null,null,null,null,null,null,null,null,{"$f":"NOW()","v":42842.612082291664}]
["Sıra No","Göğüs No","Doğum Tarihi\nGün/Ay/Yıl","Adı ve Soyadı","TAKIMI","Derece","Puan",null,"1. SERİ",null,null,null,"Rüzgar:","-0.6"]
[null,null,null,null,null,null,null,null,"Kulvar","Formül","Göğüs No","Doğum Tarihi","Adı ve Soyadı","TAKIMI","Elektronik Kronometre","El Kronometre","Seri Geliş"]
[1,null,null,"CANAN FİL","FORD OTOSAN",1425,11,null,1,"100M-1-1",{"$f":"IF(ISERROR(VLOOKUP(J8,#REF!,2,0)),\"\",(VLOOKUP(J8,#REF!,2,0)))","v":""},{"$f":"IF(ISERROR(VLOOKUP(J8,#REF!,4,0)),\"\",(VLOOKUP(J8,#REF!,4,0)))","v":""},{"$f":"IF(ISERROR(VLOOKUP(J8,#REF!,5,0)),\"\",(VLOOKUP(J8,#REF!,5,0)))","v":""},{"$f":"IF(ISERROR(VLOOKUP(J8,#REF!,6,0)),\"\",(VLOOKUP(J8,#REF!,6,0)))","v":""}]
[2,null,null,"ECEM ERERMİŞ","TÜPRAŞ",1596,10,null,2,"100M-1-2",{"$f":"IF(ISERROR(VLOOKUP(J9,#REF!,2,0)),\"\",(VLOOKUP(J9,#REF!,2,0)))","v":""},{"$f":"IF(ISERROR(VLOOKUP(J9,#REF!,4,0)),\"\",(VLOOKUP(J9,#REF!,4,0)))","v":""},"ÖZLEM KURT","ZER",1959,null,5]
[3,null,null,"AYLİN ÖZDEMİR","YAPI KREDİ",1656,9,null,3,"100M-1-3",{"$f":"IF(ISERROR(VLOOKUP(J10,#REF!,2,0)),\"\",(VLOOKUP(J10,#REF!,2,0)))","v":""},{"$f":"IF(ISERROR(VLOOKUP(J10,#REF!,4,0)),\"\",(VLOOKUP(J10,#REF!,4,0)))","v":""},"AYLİN ÖZDEMİR","YAPI KREDİ",1656,null,3]
[4,null,null,"RUKİYE DİNDAR","TOFAŞ",1938,8,null,4,"100M-1-4",{"$f":"IF(ISERROR(VLOOKUP(J11,#REF!,2,0)),\"\",(VLOOKUP(J11,#REF!,2,0)))","v":""},{"$f":"IF(ISERROR(VLOOKUP(J11,#REF!,4,0)),\"\",(VLOOKUP(J11,#REF!,4,0)))","v":""},"CANAN FİL","FORD OTOSAN",1425,null,1]
[5,null,null,"ÖZLEM KURT","ZER",1959,7,null,5,"100M-1-5",{"$f":"IF(ISERROR(VLOOKUP(J12,#REF!,2,0)),\"\",(VLOOKUP(J12,#REF!,2,0)))","v":""},{"$f":"IF(ISERROR(VLOOKUP(J12,#REF!,4,0)),\"\",(VLOOKUP(J12,#REF!,4,0)))","v":""},"ECEM ERERMİŞ","TÜPRAŞ",1596,null,2]
["-",null,null,"ESİN KORKUT","ARÇELİK","DNS",0,null,6,"100M-1-6",{"$f":"IF(ISERROR(VLOOKUP(J13,#REF!,2,0)),\"\",(VLOOKUP(J13,#REF!,2,0)))","v":""},{"$f":"IF(ISERROR(VLOOKUP(J13,#REF!,4,0)),\"\",(VLOOKUP(J13,#REF!,4,0)))","v":""},"ESİN KORKUT","ARÇELİK","DNS",null,"-"]
[null,null,null,null,null,null,null,null,7,"100M-1-7",{"$f":"IF(ISERROR(VLOOKUP(J14,#REF!,2,0)),\"\",(VLOOKUP(J14,#REF!,2,0)))","v":""},{"$f":"IF(ISERROR(VLOOKUP(J14,#REF!,4,0)),\"\",(VLOOKUP(J14,#REF!,4,0)))","v":""},"RUKİYE DİNDAR","TOFAŞ",1938,null,4]
[null,null,null,null,null,null,null,null,8,"100M-1-8",{"$f":"IF(ISERROR(VLOOKUP(J15,#REF!,2,0)),\"\",(VLOOKUP(J15,#REF!,2,0)))","v":""},{"$f":"IF(ISERROR(VLOOKUP(J15,#REF!,4,0)),\"\",(VLOOKUP(J15,#REF!,4,0)))","v":""},{"$f":"IF(ISERROR(VLOOKUP(J15,#REF!,5,0)),\"\",(VLOOKUP(J15,#REF!,5,0)))","v":""},{"$f":"IF(ISERROR(VLOOKUP(J15,#REF!,6,0)),\"\",(VLOOKUP(J15,#REF!,6,0)))","v":""}]
[null,null,null,null,null,null,null,null,"2. SERİ",null,null,null,"Rüzgar:"]
[null,null,null,null,null,null,null,null,"Kulvar","Formül","Göğüs No","Doğum Tarihi","Adı ve Soyadı","TAKIMI","Elektronik Kronometre","El Kronometre","Seri Geliş"]
[null,null,null,null,null,null,null,null,1,"100M-2-1",{"$f":"IF(ISERROR(VLOOKUP(J18,#REF!,2,0)),\"\",(VLOOKUP(J18,#REF!,2,0)))","v":""},{"$f":"IF(ISERROR(VLOOKUP(J18,#REF!,4,0)),\"\",(VLOOKUP(J18,#REF!,4,0)))","v":""},{"$f":"IF(ISERROR(VLOOKUP(J18,#REF!,5,0)),\"\",(VLOOKUP(J18,#REF!,5,0)))","v":""},{"$f":"IF(ISERROR(VLOOKUP(J18,#REF!,6,0)),\"\",(VLOOKUP(J18,#REF!,6,0)))","v":""}]
[null,null,null,null,null,null,null,null,2,"100M-2-2",{"$f":"IF(ISERROR(VLOOKUP(J19,#REF!,2,0)),\"\",(VLOOKUP(J19,#REF!,2,0)))","v":""},{"$f":"IF(ISERROR(VLOOKUP(J19,#REF!,4,0)),\"\",(VLOOKUP(J19,#REF!,4,0)))","v":""}]
[null,null,null,null,null,null,null,null,3,"100M-2-3",{"$f":"IF(ISERROR(VLOOKUP(J20,#REF!,2,0)),\"\",(VLOOKUP(J20,#REF!,2,0)))","v":""},{"$f":"IF(ISERROR(VLOOKUP(J20,#REF!,4,0)),\"\",(VLOOKUP(J20,#REF!,4,0)))","v":""}]
[null,null,null,null,null,null,null,null,4,"100M-2-4",{"$f":"IF(ISERROR(VLOOKUP(J21,#REF!,2,0)),\"\",(VLOOKUP(J21,#REF!,2,0)))","v":""},{"$f":"IF(ISERROR(VLOOKUP(J21,#REF!,4,0)),\"\",(VLOOKUP(J21,#REF!,4,0)))","v":""}]
[null,null,null,null,null,null,null,null,5,"100M-2-5",{"$f":"IF(ISERROR(VLOOKUP(J22,#REF!,2,0)),\"\",(VLOOKUP(J22,#REF!,2,0)))","v":""},{"$f":"IF(ISERROR(VLOOKUP(J22,#REF!,4,0)),\"\",(VLOOKUP(J22,#REF!,4,0)))","v":""}]
[null,null,null,null,null,null,null,null,6,"100M-2-6",{"$f":"IF(ISERROR(VLOOKUP(J23,#REF!,2,0)),\"\",(VLOOKUP(J23,#REF!,2,0)))","v":""},{"$f":"IF(ISERROR(VLOOKUP(J23,#REF!,4,0)),\"\",(VLOOKUP(J23,#REF!,4,0)))","v":""}]
[null,null,null,null,null,null,null,null,7,"100M-2-7",{"$f":"IF(ISERROR(VLOOKUP(J24,#REF!,2,0)),\"\",(VLOOKUP(J24,#REF!,2,0)))","v":""},{"$f":"IF(ISERROR(VLOOKUP(J24,#REF!,4,0)),\"\",(VLOOKUP(J24,#REF!,4,0)))","v":""},{"$f":"IF(ISERROR(VLOOKUP(J24,#REF!,5,0)),\"\",(VLOOKUP(J24,#REF!,5,0)))","v":""},{"$f":"IF(ISERROR(VLOOKUP(J24,#REF!,6,0)),\"\",(VLOOKUP(J24,#REF!,6,0)))","v":""}]
[null,null,null,null,null,null,null,null,8,"100M-2-8",{"$f":"IF(ISERROR(VLOOKUP(J25,#REF!,2,0)),\"\",(VLOOKUP(J25,#REF!,2,0)))","v":""},{"$f":"IF(ISERROR(VLOOKUP(J25,#REF!,4,0)),\"\",(VLOOKUP(J25,#REF!,4,0)))","v":""},{"$f":"IF(ISERROR(VLOOKUP(J25,#REF!,5,0)),\"\",(VLOOKUP(J25,#REF!,5,0)))","v":""},{"$f":"IF(ISERROR(VLOOKUP(J25,#REF!,6,0)),\"\",(VLOOKUP(J25,#REF!,6,0)))","v":""}]
[null,null,null,null,null,null,null,null,"3. SERİ",null,null,null,"Rüzgar:"]
[null,null,null,null,null,null,null,null,"Kulvar","Formül","Göğüs No","Doğum Tarihi","Adı ve Soyadı","Okulu","Elektronik Kronometre","El Kronometre","Seri Geliş"]
[null,null,null,null,null,null,null,null,1,"100M-3-1",{"$f":"IF(ISERROR(VLOOKUP(J28,#REF!,2,0)),\"\",(VLOOKUP(J28,#REF!,2,0)))","v":""},{"$f":"IF(ISERROR(VLOOKUP(J28,#REF!,4,0)),\"\",(VLOOKUP(J28,#REF!,4,0)))","v":""},{"$f":"IF(ISERROR(VLOOKUP(J28,#REF!,5,0)),\"\",(VLOOKUP(J28,#REF!,5,0)))","v":""},{"$f":"IF(ISERROR(VLOOKUP(J28,#REF!,6,0)),\"\",(VLOOKUP(J28,#REF!,6,0)))","v":""},"      "]
[null,null,null,null,null,null,null,null,2,"100M-3-2",{"$f":"IF(ISERROR(VLOOKUP(J29,#REF!,2,0)),\"\",(VLOOKUP(J29,#REF!,2,0)))","v":""},{"$f":"IF(ISERROR(VLOOKUP(J29,#REF!,4,0)),\"\",(VLOOKUP(J29,#REF!,4,0)))","v":""}]
[null,null,null,null,null,null,null,null,3,"100M-3-3",{"$f":"IF(ISERROR(VLOOKUP(J30,#REF!,2,0)),\"\",(VLOOKUP(J30,#REF!,2,0)))","v":""},{"$f":"IF(ISERROR(VLOOKUP(J30,#REF!,4,0)),\"\",(VLOOKUP(J30,#REF!,4,0)))","v":""}]
[null,null,null,null,null,null,null,null,4,"100M-3-4",{"$f":"IF(ISERROR(VLOOKUP(J31,#REF!,2,0)),\"\",(VLOOKUP(J31,#REF!,2,0)))","v":""},{"$f":"IF(ISERROR(VLOOKUP(J31,#REF!,4,0)),\"\",(VLOOKUP(J31,#REF!,4,0)))","v":""}]
[null,null,null,null,null,null,null,null,5,"100M-3-5",{"$f":"IF(ISERROR(VLOOKUP(J32,#REF!,2,0)),\"\",(VLOOKUP(J32,#REF!,2,0)))","v":""},{"$f":"IF(ISERROR(VLOOKUP(J32,#REF!,4,0)),\"\",(VLOOKUP(J32,#REF!,4,0)))","v":""}]
[null,null,null,null,null,null,null,null,6,"100M-3-6",{"$f":"IF(ISERROR(VLOOKUP(J33,#REF!,2,0)),\"\",(VLOOKUP(J33,#REF!,2,0)))","v":""},{"$f":"IF(ISERROR(VLOOKUP(J33,#REF!,4,0)),\"\",(VLOOKUP(J33,#REF!,4,0)))","v":""},{"$f":"IF(ISERROR(VLOOKUP(J33,#REF!,5,0)),\"\",(VLOOKUP(J33,#REF!,5,0)))","v":""},{"$f":"IF(ISERROR(VLOOKUP(J33,#REF!,6,0)),\"\",(VLOOKUP(J33,#REF!,6,0)))","v":""}]
[null,null,null,null,null,null,null,null,7,"100M-3-7",{"$f":"IF(ISERROR(VLOOKUP(J34,#REF!,2,0)),\"\",(VLOOKUP(J34,#REF!,2,0)))","v":""},{"$f":"IF(ISERROR(VLOOKUP(J34,#REF!,4,0)),\"\",(VLOOKUP(J34,#REF!,4,0)))","v":""},{"$f":"IF(ISERROR(VLOOKUP(J34,#REF!,5,0)),\"\",(VLOOKUP(J34,#REF!,5,0)))","v":""},{"$f":"IF(ISERROR(VLOOKUP(J34,#REF!,6,0)),\"\",(VLOOKUP(J34,#REF!,6,0)))","v":""}]
[null,null,null,null,null,null,null,null,8,"100M-3-8",{"$f":"IF(ISERROR(VLOOKUP(J35,#REF!,2,0)),\"\",(VLOOKUP(J35,#REF!,2,0)))","v":""},{"$f":"IF(ISERROR(VLOOKUP(J35,#REF!,4,0)),\"\",(VLOOKUP(J35,#REF!,4,0)))","v":""},{"$f":"IF(ISERROR(VLOOKUP(J35,#REF!,5,0)),\"\",(VLOOKUP(J35,#REF!,5,0)))","v":""},{"$f":"IF(ISERROR(VLOOKUP(J35,#REF!,6,0)),\"\",(VLOOKUP(J35,#REF!,6,0)))","v":""}]
[null,null,null,null,null,null,null,null,"4. SERİ",null,null,null,"Rüzgar:"]
[null,null,null,null,null,null,null,null,"Kulvar","Formül","Göğüs No","Doğum Tarihi","Adı ve Soyadı","Okulu","Elektronik Kronometre","Derece","Seri Geliş"]
[null,null,null,null,null,null,null,null,1,"100M-4-1",{"$f":"IF(ISERROR(VLOOKUP(J38,#REF!,2,0)),\"\",(VLOOKUP(J38,#REF!,2,0)))","v":""},{"$f":"IF(ISERROR(VLOOKUP(J38,#REF!,4,0)),\"\",(VLOOKUP(J38,#REF!,4,0)))","v":""},{"$f":"IF(ISERROR(VLOOKUP(J38,#REF!,5,0)),\"\",(VLOOKUP(J38,#REF!,5,0)))","v":""},{"$f":"IF(ISERROR(VLOOKUP(J38,#REF!,6,0)),\"\",(VLOOKUP(J38,#REF!,6,0)))","v":""},{"$f":"IF(IF(OR(P38=\"NM\",P38=\"DNF\",P38=\"DNS\",P38=\"DQ\",P38=\"\"),P38,(ROUNDUP(P38,)+24))=0,\" \",IF(OR(P38=\"NM\",P38=\"DNF\",P38=\"DNS\",P38=\"DQ\",P38=\"\"),P38,(ROUNDUP(P38,)+24)))","v":" "}]
[null,null,null,null,null,null,null,null,2,"100M-4-2",{"$f":"IF(ISERROR(VLOOKUP(J39,#REF!,2,0)),\"\",(VLOOKUP(J39,#REF!,2,0)))","v":""},{"$f":"IF(ISERROR(VLOOKUP(J39,#REF!,4,0)),\"\",(VLOOKUP(J39,#REF!,4,0)))","v":""}]
[null,null,null,null,null,null,null,null,3,"100M-4-3",{"$f":"IF(ISERROR(VLOOKUP(J40,#REF!,2,0)),\"\",(VLOOKUP(J40,#REF!,2,0)))","v":""},{"$f":"IF(ISERROR(VLOOKUP(J40,#REF!,4,0)),\"\",(VLOOKUP(J40,#REF!,4,0)))","v":""}]
[null,null,null,null,null,null,null,null,4,"100M-4-4",{"$f":"IF(ISERROR(VLOOKUP(J41,#REF!,2,0)),\"\",(VLOOKUP(J41,#REF!,2,0)))","v":""},{"$f":"IF(ISERROR(VLOOKUP(J41,#REF!,4,0)),\"\",(VLOOKUP(J41,#REF!,4,0)))","v":""}]
[null,null,null,null,null,null,null,null,5,"100M-4-5",{"$f":"IF(ISERROR(VLOOKUP(J42,#REF!,2,0)),\"\",(VLOOKUP(J42,#REF!,2,0)))","v":""},{"$f":"IF(ISERROR(VLOOKUP(J42,#REF!,4,0)),\"\",(VLOOKUP(J42,#REF!,4,0)))","v":""}]
[null,null,null,null,null,null,null,null,6,"100M-4-6",{"$f":"IF(ISERROR(VLOOKUP(J43,#REF!,2,0)),\"\",(VLOOKUP(J43,#REF!,2,0)))","v":""},{"$f":"IF(ISERROR(VLOOKUP(J43,#REF!,4,0)),\"\",(VLOOKUP(J43,#REF!,4,0)))","v":""},null,{"$f":"IF(ISERROR(VLOOKUP(J43,#REF!,6,0)),\"\",(VLOOKUP(J43,#REF!,6,0)))","v":""}]
[null,null,null,null,null,null,null,null,7,"100M-4-7",{"$f":"IF(ISERROR(VLOOKUP(J44,#REF!,2,0)),\"\",(VLOOKUP(J44,#REF!,2,0)))","v":""},{"$f":"IF(ISERROR(VLOOKUP(J44,#REF!,4,0)),\"\",(VLOOKUP(J44,#REF!,4,0)))","v":""},{"$f":"IF(ISERROR(VLOOKUP(J44,#REF!,5,0)),\"\",(VLOOKUP(J44,#REF!,5,0)))","v":""},{"$f":"IF(ISERROR(VLOOKUP(J44,#REF!,6,0)),\"\",(VLOOKUP(J44,#REF!,6,0)))","v":""}]
[null,null,null,null,null,null,null,null,8,"100M-4-8",{"$f":"IF(ISERROR(VLOOKUP(J45,#REF!,2,0)),\"\",(VLOOKUP(J45,#REF!,2,0)))","v":""},{"$f":"IF(ISERROR(VLOOKUP(J45,#REF!,4,0)),\"\",(VLOOKUP(J45,#REF!,4,0)))","v":""},{"$f":"IF(ISERROR(VLOOKUP(J45,#REF!,5,0)),\"\",(VLOOKUP(J45,#REF!,5,0)))","v":""},{"$f":"IF(ISERROR(VLOOKUP(J45,#REF!,6,0)),\"\",(VLOOKUP(J45,#REF!,6,0)))","v":""}]
[null,null,null,null,null,null,{"$f":"IF(ISTEXT(F46),\" \",IFERROR(VLOOKUP(SMALL(PUAN!$A$6:$F$111,COUNTIF(PUAN!$A$6:$F$111,\"<\"&F46)+1),PUAN!$A$6:$F$111,4,0),\"    \"))","v":"    "},null,"5. SERİ",null,null,null,"Rüzgar:"]
[null,null,null,null,null,null,{"$f":"IF(ISTEXT(F47),\" \",IFERROR(VLOOKUP(SMALL(PUAN!$A$6:$F$111,COUNTIF(PUAN!$A$6:$F$111,\"<\"&F47)+1),PUAN!$A$6:$F$111,4,0),\"    \"))","v":"    "},null,"Kulvar","Formül","Göğüs No","Doğum Tarihi","Adı ve Soyadı","Okulu","Elektronik Kronometre","El Kronometre","Seri Geliş"]
[null,null,null,null,null,null,{"$f":"IF(ISTEXT(F48),\" \",IFERROR(VLOOKUP(SMALL(PUAN!$A$6:$F$111,COUNTIF(PUAN!$A$6:$F$111,\"<\"&F48)+1),PUAN!$A$6:$F$111,4,0),\"    \"))","v":"    "},null,1,"100M-5-1",{"$f":"IF(ISERROR(VLOOKUP(J48,#REF!,2,0)),\"\",(VLOOKUP(J48,#REF!,2,0)))","v":""},{"$f":"IF(ISERROR(VLOOKUP(J48,#REF!,4,0)),\"\",(VLOOKUP(J48,#REF!,4,0)))","v":""},{"$f":"IF(ISERROR(VLOOKUP(J48,#REF!,5,0)),\"\",(VLOOKUP(J48,#REF!,5,0)))","v":""},{"$f":"IF(ISERROR(VLOOKUP(J48,#REF!,6,0)),\"\",(VLOOKUP(J48,#REF!,6,0)))","v":""}]
[null,null,null,null,null,null,{"$f":"IF(ISTEXT(F49),\" \",IFERROR(VLOOKUP(SMALL(PUAN!$A$6:$F$111,COUNTIF(PUAN!$A$6:$F$111,\"<\"&F49)+1),PUAN!$A$6:$F$111,4,0),\"    \"))","v":"    "},null,2,"100M-5-2",{"$f":"IF(ISERROR(VLOOKUP(J49,#REF!,2,0)),\"\",(VLOOKUP(J49,#REF!,2,0)))","v":""},{"$f":"IF(ISERROR(VLOOKUP(J49,#REF!,4,0)),\"\",(VLOOKUP(J49,#REF!,4,0)))","v":""}]
[null,null,null,null,null,null,{"$f":"IF(ISTEXT(F50),\" \",IFERROR(VLOOKUP(SMALL(PUAN!$A$6:$F$111,COUNTIF(PUAN!$A$6:$F$111,\"<\"&F50)+1),PUAN!$A$6:$F$111,4,0),\"    \"))","v":"    "},null,3,"100M-5-3",{"$f":"IF(ISERROR(VLOOKUP(J50,#REF!,2,0)),\"\",(VLOOKUP(J50,#REF!,2,0)))","v":""},{"$f":"IF(ISERROR(VLOOKUP(J50,#REF!,4,0)),\"\",(VLOOKUP(J50,#REF!,4,0)))","v":""}]
[null,null,null,null,null,null,{"$f":"IF(ISTEXT(F51),\" \",IFERROR(VLOOKUP(SMALL(PUAN!$A$6:$F$111,COUNTIF(PUAN!$A$6:$F$111,\"<\"&F51)+1),PUAN!$A$6:$F$111,4,0),\"    \"))","v":"    "},null,4,"100M-5-4",{"$f":"IF(ISERROR(VLOOKUP(J51,#REF!,2,0)),\"\",(VLOOKUP(J51,#REF!,2,0)))","v":""},{"$f":"IF(ISERROR(VLOOKUP(J51,#REF!,4,0)),\"\",(VLOOKUP(J51,#REF!,4,0)))","v":""}]
[null,null,null,null,null,null,{"$f":"IF(ISTEXT(F52),\" \",IFERROR(VLOOKUP(SMALL(PUAN!$A$6:$F$111,COUNTIF(PUAN!$A$6:$F$111,\"<\"&F52)+1),PUAN!$A$6:$F$111,4,0),\"    \"))","v":"    "},null,5,"100M-5-5",{"$f":"IF(ISERROR(VLOOKUP(J52,#REF!,2,0)),\"\",(VLOOKUP(J52,#REF!,2,0)))","v":""},{"$f":"IF(ISERROR(VLOOKUP(J52,#REF!,4,0)),\"\",(VLOOKUP(J52,#REF!,4,0)))","v":""}]
[null,null,null,null,null,null,{"$f":"IF(ISTEXT(F53),\" \",IFERROR(VLOOKUP(SMALL(PUAN!$A$6:$F$111,COUNTIF(PUAN!$A$6:$F$111,\"<\"&F53)+1),PUAN!$A$6:$F$111,4,0),\"    \"))","v":"    "},null,6,"100M-5-6",{"$f":"IF(ISERROR(VLOOKUP(J53,#REF!,2,0)),\"\",(VLOOKUP(J53,#REF!,2,0)))","v":""},{"$f":"IF(ISERROR(VLOOKUP(J53,#REF!,4,0)),\"\",(VLOOKUP(J53,#REF!,4,0)))","v":""},{"$f":"IF(ISERROR(VLOOKUP(J53,#REF!,5,0)),\"\",(VLOOKUP(J53,#REF!,5,0)))","v":""},{"$f":"IF(ISERROR(VLOOKUP(J53,#REF!,6,0)),\"\",(VLOOKUP(J53,#REF!,6,0)))","v":""}]
[null,null,null,null,null,null,{"$f":"IF(ISTEXT(F54),\" \",IFERROR(VLOOKUP(SMALL(PUAN!$A$6:$F$111,COUNTIF(PUAN!$A$6:$F$111,\"<\"&F54)+1),PUAN!$A$6:$F$111,4,0),\"    \"))","v":"    "},null,7,"100M-5-7",{"$f":"IF(ISERROR(VLOOKUP(J54,#REF!,2,0)),\"\",(VLOOKUP(J54,#REF!,2,0)))","v":""},{"$f":"IF(ISERROR(VLOOKUP(J54,#REF!,4,0)),\"\",(VLOOKUP(J54,#REF!,4,0)))","v":""},{"$f":"IF(ISERROR(VLOOKUP(J54,#REF!,5,0)),\"\",(VLOOKUP(J54,#REF!,5,0)))","v":""},{"$f":"IF(ISERROR(VLOOKUP(J54,#REF!,6,0)),\"\",(VLOOKUP(J54,#REF!,6,0)))","v":""}]
[null,null,null,null,null,null,{"$f":"IF(ISTEXT(F55),\" \",IFERROR(VLOOKUP(SMALL(PUAN!$A$6:$F$111,COUNTIF(PUAN!$A$6:$F$111,\"<\"&F55)+1),PUAN!$A$6:$F$111,4,0),\"    \"))","v":"    "},null,8,"100M-5-8",{"$f":"IF(ISERROR(VLOOKUP(J55,#REF!,2,0)),\"\",(VLOOKUP(J55,#REF!,2,0)))","v":""},{"$f":"IF(ISERROR(VLOOKUP(J55,#REF!,4,0)),\"\",(VLOOKUP(J55,#REF!,4,0)))","v":""},{"$f":"IF(ISERROR(VLOOKUP(J55,#REF!,5,0)),\"\",(VLOOKUP(J55,#REF!,5,0)))","v":""},{"$f":"IF(ISERROR(VLOOKUP(J55,#REF!,6,0)),\"\",(VLOOKUP(J55,#REF!,6,0)))","v":""},{"$f":"IF(IF(OR(P55=\"NM\",P55=\"DNF\",P55=\"DNS\",P55=\"DQ\",P55=\"\"),P55,(ROUNDUP(P55,)+24))=0,\" \",IF(OR(P55=\"NM\",P55=\"DNF\",P55=\"DNS\",P55=\"DQ\",P55=\"\"),P55,(ROUNDUP(P55,)+24)))","v":" "}]
[]
["Müsabakalar Direktörü",null,null,null,"Baş Hakem","Lider",null,"Sekreter",null,null,null,null,"Hakem","Hakem",null,"Hakem"]

{"sheet":"200m.","index":4,"n_rows":47,"n_cols":17,"rows_kept":47,"cut":false,"hidden":false,"merged":[[5,3,6,3],[5,4,6,4],[2,13,2,16],[2,8,2,10],[5,0,6,0],[5,1,6,1],[3,0,3,2],[3,3,3,4],[3,13,3,16],[4,13,4,16],[5,6,6,6],[5,5,6,5],[5,2,6,2],[0,0,0,16],[1,0,1,16],[2,0,2,2],[2,3,2,4],[2,5,2,6]]}
[]
[{"$f":"'YARIŞMA BİLGİLERİ'!F19","v":"KOÇ TOPLULUĞU SPOR ŞENLİĞİ PUANLI ATLETİZM YARIŞLARI"}]
["Yarışma :",null,null,"200 Metre",null,null,null,":"]
["Kategori :",null,null,{"$f":"'YARIŞMA BİLGİLERİ'!F21","v":"Kadınlar"},null,null,null,null,null,null,null,null,"Tarih-Saat :",{"$f":"'YARIŞMA PROGRAMI'!B8","v":"15 Nisan 2017 - 12:45"}]
[null,null,null,null,null,null,null,null,null,null,null,null,null,{"$f":"NOW()","v":42842.612082291664}]
["Sıra No","Göğüs No","Doğum Tarihi\nGün/Ay/Yıl","Adı ve Soyadı","Okulu","Derece","Puan",null,"1. SERİ"]
[null,null,null,null,null,null,null,null,"Kulvar","Formül","Göğüs No","Doğum Tarihi","Adı ve Soyadı","Okulu","Elektronik Kronometre","El Kronometre","Seri Geliş"]
[1,null,null,"İNCİ ÖZDEMİR","FORD OTOSAN",3365,11,null,1,"300M-1-1",{"$f":"IF(ISERROR(VLOOKUP(J8,#REF!,2,0)),\"\",(VLOOKUP(J8,#REF!,2,0)))","v":""},{"$f":"IF(ISERROR(VLOOKUP(J8,#REF!,4,0)),\"\",(VLOOKUP(J8,#REF!,4,0)))","v":""},{"$f":"IF(ISERROR(VLOOKUP(J8,#REF!,5,0)),\"\",(VLOOKUP(J8,#REF!,5,0)))","v":""},{"$f":"IF(ISERROR(VLOOKUP(J8,#REF!,6,0)),\"\",(VLOOKUP(J8,#REF!,6,0)))","v":""}]
[2,null,null,"SELİN GÜVEN","TÜPRAŞ",3495,10,null,2,"300M-1-2",{"$f":"IF(ISERROR(VLOOKUP(J9,#REF!,2,0)),\"\",(VLOOKUP(J9,#REF!,2,0)))","v":""},{"$f":"IF(ISERROR(VLOOKUP(J9,#REF!,4,0)),\"\",(VLOOKUP(J9,#REF!,4,0)))","v":""},{"$f":"IF(ISERROR(VLOOKUP(J9,#REF!,5,0)),\"\",(VLOOKUP(J9,#REF!,5,0)))","v":""}]
[3,null,null,"ECEMSU HANGÜL","KOÇ SİSTEM",3823,9,null,3,"300M-1-3",{"$f":"IF(ISERROR(VLOOKUP(J10,#REF!,2,0)),\"\",(VLOOKUP(J10,#REF!,2,0)))","v":""},{"$f":"IF(ISERROR(VLOOKUP(J10,#REF!,4,0)),\"\",(VLOOKUP(J10,#REF!,4,0)))","v":""},"İNCİ ÖZDEMİR","FORD OTOSAN",3365,null,1]
[4,null,null,"TÜRKAN KORKMAZ","TOFAŞ",3829,8,null,4,"300M-1-4",{"$f":"IF(ISERROR(VLOOKUP(J11,#REF!,2,0)),\"\",(VLOOKUP(J11,#REF!,2,0)))","v":""},{"$f":"IF(ISERROR(VLOOKUP(J11,#REF!,4,0)),\"\",(VLOOKUP(J11,#REF!,4,0)))","v":""},"BURCU GÜNEL","OPET",4427,null,3]
[5,null,null,"AYŞEGÜL BAYRAK","YAPI KREDİ",3903,7,null,5,"300M-1-5",{"$f":"IF(ISERROR(VLOOKUP(J12,#REF!,2,0)),\"\",(VLOOKUP(J12,#REF!,2,0)))","v":""},{"$f":"IF(ISERROR(VLOOKUP(J12,#REF!,4,0)),\"\",(VLOOKUP(J12,#REF!,4,0)))","v":""},"YASEMİN ÇORAKLI","VKV SAĞLIK KURULUŞLARI","DNS",null,"-"]
[6,null,null,"SENEM DEVECİ","TÜPRAŞ",3930,"-",null,6,"300M-1-6",{"$f":"IF(ISERROR(VLOOKUP(J13,#REF!,2,0)),\"\",(VLOOKUP(J13,#REF!,2,0)))","v":""},{"$f":"IF(ISERROR(VLOOKUP(J13,#REF!,4,0)),\"\",(VLOOKUP(J13,#REF!,4,0)))","v":""},"TÜRKAN KORKMAZ","TOFAŞ",3829,null,2]
[7,null,null,"ÖZLEM KARAKUZU","YAPI KREDİ",3949,"-",null,7,"300M-1-7",{"$f":"IF(ISERROR(VLOOKUP(J14,#REF!,2,0)),\"\",(VLOOKUP(J14,#REF!,2,0)))","v":""},{"$f":"IF(ISERROR(VLOOKUP(J14,#REF!,4,0)),\"\",(VLOOKUP(J14,#REF!,4,0)))","v":""},{"$f":"IF(ISERROR(VLOOKUP(J14,#REF!,5,0)),\"\",(VLOOKUP(J14,#REF!,5,0)))","v":""},{"$f":"IF(ISERROR(VLOOKUP(J14,#REF!,6,0)),\"\",(VLOOKUP(J14,#REF!,6,0)))","v":""}]
[8,null,null,"BURLA KOÇYİĞİT","TÜPRAŞ",4081,"-",null,8,"300M-1-8",{"$f":"IF(ISERROR(VLOOKUP(J15,#REF!,2,0)),\"\",(VLOOKUP(J15,#REF!,2,0)))","v":""},{"$f":"IF(ISERROR(VLOOKUP(J15,#REF!,4,0)),\"\",(VLOOKUP(J15,#REF!,4,0)))","v":""},{"$f":"IF(ISERROR(VLOOKUP(J15,#REF!,5,0)),\"\",(VLOOKUP(J15,#REF!,5,0)))","v":""},{"$f":"IF(ISERROR(VLOOKUP(J15,#REF!,6,0)),\"\",(VLOOKUP(J15,#REF!,6,0)))","v":""}]
[9,null,null,"SİBEL MOL","ARÇELİK",4138,6,null,"2. SERİ",null,null,null,null,"RÜZGAR:-1.4"]
[10,null,null,"EZGİ ORAN","ZER",4249,5,null,"Kulvar","Formül","Göğüs No","Doğum Tarihi","Adı ve Soyadı","Okulu","Elektronik Kronometre","El Kronometre","Seri Geliş"]
[11,null,null,"ZEYNEP ERPOLAT","ARÇELİK",4340,"-",null,1,"300M-2-1",{"$f":"IF(ISERROR(VLOOKUP(J18,#REF!,2,0)),\"\",(VLOOKUP(J18,#REF!,2,0)))","v":""},{"$f":"IF(ISERROR(VLOOKUP(J18,#REF!,4,0)),\"\",(VLOOKUP(J18,#REF!,4,0)))","v":""},{"$f":"IF(ISERROR(VLOOKUP(J18,#REF!,5,0)),\"\",(VLOOKUP(J18,#REF!,5,0)))","v":""},{"$f":"IF(ISERROR(VLOOKUP(J18,#REF!,6,0)),\"\",(VLOOKUP(J18,#REF!,6,0)))","v":""}]
[12,null,null,"BURCU GÜNEL","OPET",4427,4,null,2,"300M-2-2",{"$f":"IF(ISERROR(VLOOKUP(J19,#REF!,2,0)),\"\",(VLOOKUP(J19,#REF!,2,0)))","v":""},{"$f":"IF(ISERROR(VLOOKUP(J19,#REF!,4,0)),\"\",(VLOOKUP(J19,#REF!,4,0)))","v":""},"AYŞEGÜL BAYRAK","YAPI KREDİ",3903,null,2]
["-",null,null,"YASEMİN ÇORAKLI","VKV SAĞLIK KURULUŞLARI","DNS","-",null,3,"300M-2-3",{"$f":"IF(ISERROR(VLOOKUP(J20,#REF!,2,0)),\"\",(VLOOKUP(J20,#REF!,2,0)))","v":""},{"$f":"IF(ISERROR(VLOOKUP(J20,#REF!,4,0)),\"\",(VLOOKUP(J20,#REF!,4,0)))","v":""},"ZEYNEP ERPOLAT","ARÇELİK",4340,null,3]
["-",null,null,"SİNEM BAŞ","TÜPRAŞ","DNS","-",null,4,"300M-2-4",{"$f":"IF(ISERROR(VLOOKUP(J21,#REF!,2,0)),\"\",(VLOOKUP(J21,#REF!,2,0)))","v":""},{"$f":"IF(ISERROR(VLOOKUP(J21,#REF!,4,0)),\"\",(VLOOKUP(J21,#REF!,4,0)))","v":""},"ECEMSU HANGÜL","KOÇ SİSTEM",3823,null,1]
["-",null,null,"ÜLVİYE DERYA COŞKUN","ZER","DNS","-",null,5,"300M-2-5",{"$f":"IF(ISERROR(VLOOKUP(J22,#REF!,2,0)),\"\",(VLOOKUP(J22,#REF!,2,0)))","v":""},{"$f":"IF(ISERROR(VLOOKUP(J22,#REF!,4,0)),\"\",(VLOOKUP(J22,#REF!,4,0)))","v":""},"SİNEM BAŞ","TÜPRAŞ","DNS",null,"-"]
["-",null,null,"GÜLŞEN ŞAHİN","TÜPRAŞ","DNS","-",null,6,"300M-2-6",{"$f":"IF(ISERROR(VLOOKUP(J23,#REF!,2,0)),\"\",(VLOOKUP(J23,#REF!,2,0)))","v":""},{"$f":"IF(ISERROR(VLOOKUP(J23,#REF!,4,0)),\"\",(VLOOKUP(J23,#REF!,4,0)))","v":""},"ÜLVİYE DERYA COŞKUN","ZER","DNS",null,"-"]
[null,null,null,null,null,null,null,null,7,"300M-2-7",{"$f":"IF(ISERROR(VLOOKUP(J24,#REF!,2,0)),\"\",(VLOOKUP(J24,#REF!,2,0)))","v":""},{"$f":"IF(ISERROR(VLOOKUP(J24,#REF!,4,0)),\"\",(VLOOKUP(J24,#REF!,4,0)))","v":""},{"$f":"IF(ISERROR(VLOOKUP(J24,#REF!,5,0)),\"\",(VLOOKUP(J24,#REF!,5,0)))","v":""},{"$f":"IF(ISERROR(VLOOKUP(J24,#REF!,6,0)),\"\",(VLOOKUP(J24,#REF!,6,0)))","v":""}]
[null,null,null,null,null,null,null,null,8,"300M-2-8",{"$f":"IF(ISERROR(VLOOKUP(J25,#REF!,2,0)),\"\",(VLOOKUP(J25,#REF!,2,0)))","v":""},{"$f":"IF(ISERROR(VLOOKUP(J25,#REF!,4,0)),\"\",(VLOOKUP(J25,#REF!,4,0)))","v":""},{"$f":"IF(ISERROR(VLOOKUP(J25,#REF!,5,0)),\"\",(VLOOKUP(J25,#REF!,5,0)))","v":""},{"$f":"IF(ISERROR(VLOOKUP(J25,#REF!,6,0)),\"\",(VLOOKUP(J25,#REF!,6,0)))","v":""}]
[null,null,null,null,null,null,null,null,"3. SERİ",null,null,null,null,"RÜZGAR:-1.4"]
[null,null,null,null,null,null,null,null,"Kulvar","Formül","Göğüs No","Doğum Tarihi","Adı ve Soyadı","Okulu","Elektronik Kronometre","El Kronometre","Seri Geliş"]
[null,null,null,null,null,null,null,null,1,"300M-3-1",{"$f":"IF(ISERROR(VLOOKUP(J28,#REF!,2,0)),\"\",(VLOOKUP(J28,#REF!,2,0)))","v":""},{"$f":"IF(ISERROR(VLOOKUP(J28,#REF!,4,0)),\"\",(VLOOKUP(J28,#REF!,4,0)))","v":""},{"$f":"IF(ISERROR(VLOOKUP(J28,#REF!,5,0)),\"\",(VLOOKUP(J28,#REF!,5,0)))","v":""},{"$f":"IF(ISERROR(VLOOKUP(J28,#REF!,6,0)),\"\",(VLOOKUP(J28,#REF!,6,0)))","v":""},{"$f":"IF(IF(OR(P28=\"NM\",P28=\"DNF\",P28=\"DNS\",P28=\"DQ\",P28=\"\"),P28,(ROUNDUP(P28,)+24))=0,\" \",IF(OR(P28=\"NM\",P28=\"DNF\",P28=\"DNS\",P28=\"DQ\",P28=\"\"),P28,(ROUNDUP(P28,)+24)))","v":" "}]
[null,null,null,null,null,null,null,null,2,"300M-3-2",{"$f":"IF(ISERROR(VLOOKUP(J29,#REF!,2,0)),\"\",(VLOOKUP(J29,#REF!,2,0)))","v":""},{"$f":"IF(ISERROR(VLOOKUP(J29,#REF!,4,0)),\"\",(VLOOKUP(J29,#REF!,4,0)))","v":""},"ÖZLEM KARAKUZU","YAPI KREDİ",3949,null,2]
[null,null,null,null,null,null,null,null,3,"300M-3-3",{"$f":"IF(ISERROR(VLOOKUP(J30,#REF!,2,0)),\"\",(VLOOKUP(J30,#REF!,2,0)))","v":""},{"$f":"IF(ISERROR(VLOOKUP(J30,#REF!,4,0)),\"\",(VLOOKUP(J30,#REF!,4,0)))","v":""},"SİBEL MOL","ARÇELİK",4138,null,3]
[null,null,null,null,null,null,null,null,4,"300M-3-4",{"$f":"IF(ISERROR(VLOOKUP(J31,#REF!,2,0)),\"\",(VLOOKUP(J31,#REF!,2,0)))","v":""},{"$f":"IF(ISERROR(VLOOKUP(J31,#REF!,4,0)),\"\",(VLOOKUP(J31,#REF!,4,0)))","v":""},{"$f":"IF(ISERROR(VLOOKUP(J31,#REF!,5,0)),\"\",(VLOOKUP(J31,#REF!,5,0)))","v":""},{"$f":"IF(ISERROR(VLOOKUP(J31,#REF!,6,0)),\"\",(VLOOKUP(J31,#REF!,6,0)))","v":""}]
[null,null,null,null,null,null,null,null,5,"300M-3-5",{"$f":"IF(ISERROR(VLOOKUP(J32,#REF!,2,0)),\"\",(VLOOKUP(J32,#REF!,2,0)))","v":""},{"$f":"IF(ISERROR(VLOOKUP(J32,#REF!,4,0)),\"\",(VLOOKUP(J32,#REF!,4,0)))","v":""},"SELİN GÜVEN","TÜPRAŞ",3495,null,1]
[null,null,null,null,null,null,null,null,6,"300M-3-6",{"$f":"IF(ISERROR(VLOOKUP(J33,#REF!,2,0)),\"\",(VLOOKUP(J33,#REF!,2,0)))","v":""},{"$f":"IF(ISERROR(VLOOKUP(J33,#REF!,4,0)),\"\",(VLOOKUP(J33,#REF!,4,0)))","v":""},"EZGİ ORAN","ZER",4249,null,4]
[null,null,null,null,null,null,null,null,7,"300M-3-7",{"$f":"IF(ISERROR(VLOOKUP(J34,#REF!,2,0)),\"\",(VLOOKUP(J34,#REF!,2,0)))","v":""},{"$f":"IF(ISERROR(VLOOKUP(J34,#REF!,4,0)),\"\",(VLOOKUP(J34,#REF!,4,0)))","v":""},{"$f":"IF(ISERROR(VLOOKUP(J34,#REF!,5,0)),\"\",(VLOOKUP(J34,#REF!,5,0)))","v":""},{"$f":"IF(ISERROR(VLOOKUP(J34,#REF!,6,0)),\"\",(VLOOKUP(J34,#REF!,6,0)))","v":""}]
[null,null,null,null,null,null,null,null,8,"300M-3-8",{"$f":"IF(ISERROR(VLOOKUP(J35,#REF!,2,0)),\"\",(VLOOKUP(J35,#REF!,2,0)))","v":""},{"$f":"IF(ISERROR(VLOOKUP(J35,#REF!,4,0)),\"\",(VLOOKUP(J35,#REF!,4,0)))","v":""},{"$f":"IF(ISERROR(VLOOKUP(J35,#REF!,5,0)),\"\",(VLOOKUP(J35,#REF!,5,0)))","v":""},{"$f":"IF(ISERROR(VLOOKUP(J35,#REF!,6,0)),\"\",(VLOOKUP(J35,#REF!,6,0)))","v":""}]
[null,null,null,null,null,null,{"$f":"IF(ISTEXT(F36),0,IFERROR(VLOOKUP(SMALL(PUAN!$E$6:$F$105,COUNTIF(PUAN!$E$6:$F$105,\"<\"&F36)+1),PUAN!$E$6:$F$105,2,2),\" \"))","v":" "},null,"4. SERİ",null,null,null,null,"RÜZGAR:-1.8"]
[null,null,null,null,null,null,{"$f":"IF(ISTEXT(F37),0,IFERROR(VLOOKUP(SMALL(PUAN!$E$6:$F$105,COUNTIF(PUAN!$E$6:$F$105,\"<\"&F37)+1),PUAN!$E$6:$F$105,2,2),\" \"))","v":" "},null,"Kulvar","Formül","Göğüs No","Doğum Tarihi","Adı ve Soyadı","Okulu","Elektronik Kronometre","Derece","Seri Geliş"]
[null,null,null,null,null,null,{"$f":"IF(ISTEXT(F38),0,IFERROR(VLOOKUP(SMALL(PUAN!$E$6:$F$105,COUNTIF(PUAN!$E$6:$F$105,\"<\"&F38)+1),PUAN!$E$6:$F$105,2,2),\" \"))","v":" "},null,1,"300M-4-1",{"$f":"IF(ISERROR(VLOOKUP(J38,#REF!,2,0)),\"\",(VLOOKUP(J38,#REF!,2,0)))","v":""},{"$f":"IF(ISERROR(VLOOKUP(J38,#REF!,4,0)),\"\",(VLOOKUP(J38,#REF!,4,0)))","v":""},{"$f":"IF(ISERROR(VLOOKUP(J38,#REF!,5,0)),\"\",(VLOOKUP(J38,#REF!,5,0)))","v":""},{"$f":"IF(ISERROR(VLOOKUP(J38,#REF!,6,0)),\"\",(VLOOKUP(J38,#REF!,6,0)))","v":""}]
[null,null,null,null,null,null,{"$f":"IF(ISTEXT(F39),0,IFERROR(VLOOKUP(SMALL(PUAN!$E$6:$F$105,COUNTIF(PUAN!$E$6:$F$105,\"<\"&F39)+1),PUAN!$E$6:$F$105,2,2),\" \"))","v":" "},null,2,"300M-4-2",{"$f":"IF(ISERROR(VLOOKUP(J39,#REF!,2,0)),\"\",(VLOOKUP(J39,#REF!,2,0)))","v":""},{"$f":"IF(ISERROR(VLOOKUP(J39,#REF!,4,0)),\"\",(VLOOKUP(J39,#REF!,4,0)))","v":""},"SENEM DEVECİ","TÜPRAŞ",3930,null,1]
[null,null,null,null,null,null,{"$f":"IF(ISTEXT(F40),0,IFERROR(VLOOKUP(SMALL(PUAN!$E$6:$F$105,COUNTIF(PUAN!$E$6:$F$105,\"<\"&F40)+1),PUAN!$E$6:$F$105,2,2),\" \"))","v":" "},null,3,"300M-4-3",{"$f":"IF(ISERROR(VLOOKUP(J40,#REF!,2,0)),\"\",(VLOOKUP(J40,#REF!,2,0)))","v":""},{"$f":"IF(ISERROR(VLOOKUP(J40,#REF!,4,0)),\"\",(VLOOKUP(J40,#REF!,4,0)))","v":""},"BURLA KOÇYİĞİT","TÜPRAŞ",4081,null,2]
[null,null,null,null,null,null,{"$f":"IF(ISTEXT(F41),0,IFERROR(VLOOKUP(SMALL(PUAN!$E$6:$F$105,COUNTIF(PUAN!$E$6:$F$105,\"<\"&F41)+1),PUAN!$E$6:$F$105,2,2),\" \"))","v":" "},null,4,"300M-4-4",{"$f":"IF(ISERROR(VLOOKUP(J41,#REF!,2,0)),\"\",(VLOOKUP(J41,#REF!,2,0)))","v":""},{"$f":"IF(ISERROR(VLOOKUP(J41,#REF!,4,0)),\"\",(VLOOKUP(J41,#REF!,4,0)))","v":""},"GÜLŞEN ŞAHİN","TÜPRAŞ","DNS",null,"-"]
[null,null,null,null,null,null,{"$f":"IF(ISTEXT(F42),0,IFERROR(VLOOKUP(SMALL(PUAN!$E$6:$F$105,COUNTIF(PUAN!$E$6:$F$105,\"<\"&F42)+1),PUAN!$E$6:$F$105,2,2),\" \"))","v":" "},null,5,"300M-4-5",{"$f":"IF(ISERROR(VLOOKUP(J42,#REF!,2,0)),\"\",(VLOOKUP(J42,#REF!,2,0)))","v":""},{"$f":"IF(ISERROR(VLOOKUP(J42,#REF!,4,0)),\"\",(VLOOKUP(J42,#REF!,4,0)))","v":""},{"$f":"IF(ISERROR(VLOOKUP(J42,#REF!,5,0)),\"\",(VLOOKUP(J42,#REF!,5,0)))","v":""},{"$f":"IF(ISERROR(VLOOKUP(J42,#REF!,6,0)),\"\",(VLOOKUP(J42,#REF!,6,0)))","v":""}]
[null,null,null,null,null,null,{"$f":"IF(ISTEXT(F43),0,IFERROR(VLOOKUP(SMALL(PUAN!$E$6:$F$105,COUNTIF(PUAN!$E$6:$F$105,\"<\"&F43)+1),PUAN!$E$6:$F$105,2,2),\" \"))","v":" "},null,6,"300M-4-6",{"$f":"IF(ISERROR(VLOOKUP(J43,#REF!,2,0)),\"\",(VLOOKUP(J43,#REF!,2,0)))","v":""},{"$f":"IF(ISERROR(VLOOKUP(J43,#REF!,4,0)),\"\",(VLOOKUP(J43,#REF!,4,0)))","v":""},{"$f":"IF(ISERROR(VLOOKUP(J43,#REF!,5,0)),\"\",(VLOOKUP(J43,#REF!,5,0)))","v":""},{"$f":"IF(ISERROR(VLOOKUP(J43,#REF!,6,0)),\"\",(VLOOKUP(J43,#REF!,6,0)))","v":""}]
[null,null,null,null,null,null,{"$f":"IF(ISTEXT(F44),0,IFERROR(VLOOKUP(SMALL(PUAN!$E$6:$F$105,COUNTIF(PUAN!$E$6:$F$105,\"<\"&F44)+1),PUAN!$E$6:$F$105,2,2),\" \"))","v":" "},null,7,"300M-4-7",{"$f":"IF(ISERROR(VLOOKUP(J44,#REF!,2,0)),\"\",(VLOOKUP(J44,#REF!,2,0)))","v":""},{"$f":"IF(ISERROR(VLOOKUP(J44,#REF!,4,0)),\"\",(VLOOKUP(J44,#REF!,4,0)))","v":""},{"$f":"IF(ISERROR(VLOOKUP(J44,#REF!,5,0)),\"\",(VLOOKUP(J44,#REF!,5,0)))","v":""},{"$f":"IF(ISERROR(VLOOKUP(J44,#REF!,6,0)),\"\",(VLOOKUP(J44,#REF!,6,0)))","v":""}]
[null,null,null,null,null,null,{"$f":"IF(ISTEXT(F45),0,IFERROR(VLOOKUP(SMALL(PUAN!$E$6:$F$105,COUNTIF(PUAN!$E$6:$F$105,\"<\"&F45)+1),PUAN!$E$6:$F$105,2,2),\" \"))","v":" "},null,8,"300M-4-8",{"$f":"IF(ISERROR(VLOOKUP(J45,#REF!,2,0)),\"\",(VLOOKUP(J45,#REF!,2,0)))","v":""},{"$f":"IF(ISERROR(VLOOKUP(J45,#REF!,4,0)),\"\",(VLOOKUP(J45,#REF!,4,0)))","v":""},{"$f":"IF(ISERROR(VLOOKUP(J45,#REF!,5,0)),\"\",(VLOOKUP(J45,#REF!,5,0)))","v":""},{"$f":"IF(ISERROR(VLOOKUP(J45,#REF!,6,0)),\"\",(VLOOKUP(J45,#REF!,6,0)))","v":""}]
[]
["Müsabakalar Direktörü",null,null,null,"Baş Hakem","Lider",null,"Sekreter",null,null,null,null,"Hakem","Hakem",null,"Hakem"]

{"sheet":"400m.","index":5,"n_rows":37,"n_cols":17,"rows_kept":37,"cut":false,"hidden":false,"merged":[[5,3,6,3],[5,4,6,4],[2,13,2,16],[2,8,2,10],[5,0,6,0],[5,1,6,1],[3,0,3,2],[3,3,3,4],[3,13,3,16],[4,13,4,16],[5,6,6,6],[5,5,6,5],[5,2,6,2],[0,0,0,16],[1,0,1,16],[2,0,2,2],[2,3,2,4],[2,5,2,6]]}
[]
[{"$f":"'YARIŞMA BİLGİLERİ'!F19","v":"KOÇ TOPLULUĞU SPOR ŞENLİĞİ PUANLI ATLETİZM YARIŞLARI"}]
["Yarışma :",null,null,"400 Metre",null,null,null,":"]
["Kategori :",null,null,{"$f":"'YARIŞMA BİLGİLERİ'!F21","v":"Kadınlar"},null,null,null,null,null,null,null,null,"Tarih-Saat :",{"$f":"'YARIŞMA PROGRAMI'!B11","v":"2017-04-15T12:15:00"}]
[null,null,null,null,null,null,null,null,null,null,null,null,null,{"$f":"NOW()","v":42842.612082291664}]
["Sıra No","Göğüs No","Doğum Tarihi\nGün/Ay/Yıl","Adı ve Soyadı","TAKIMI","Derece","Puan",null,"1. SERİ",null,null,null,"Rüzgar:"]
[null,null,null,null,null,null,null,null,"Kulvar","Formül","Göğüs No","Doğum Tarihi","Adı ve Soyadı","TAKIMI","Elektronik Kronometre","El Kronometre","Seri Geliş"]
[1,null,null,"JALE YENGİNER AKTAŞ","FORD OTOSAN",11460,11,null,1,"100M.ENG-1-1",{"$f":"IF(ISERROR(VLOOKUP(J8,#REF!,2,0)),\"\",(VLOOKUP(J8,#REF!,2,0)))","v":""},{"$f":"IF(ISERROR(VLOOKUP(J8,#REF!,4,0)),\"\",(VLOOKUP(J8,#REF!,4,0)))","v":""},{"$f":"IF(ISERROR(VLOOKUP(J8,#REF!,5,0)),\"\",(VLOOKUP(J8,#REF!,5,0)))","v":""},{"$f":"IF(ISERROR(VLOOKUP(J8,#REF!,6,0)),\"\",(VLOOKUP(J8,#REF!,6,0)))","v":""}]
[2,null,null,"ESİN YILMAZ","YAPI KREDİ",11719,10,null,2,"100M.ENG-1-2",{"$f":"IF(ISERROR(VLOOKUP(J9,#REF!,2,0)),\"\",(VLOOKUP(J9,#REF!,2,0)))","v":""},{"$f":"IF(ISERROR(VLOOKUP(J9,#REF!,4,0)),\"\",(VLOOKUP(J9,#REF!,4,0)))","v":""},"BİNAR KALKANLAR","TÜPRAŞ",12139,null,2]
[3,null,null,"BİNAR KALKANLAR","TÜPRAŞ",12139,9,null,3,"100M.ENG-1-3",{"$f":"IF(ISERROR(VLOOKUP(J10,#REF!,2,0)),\"\",(VLOOKUP(J10,#REF!,2,0)))","v":""},{"$f":"IF(ISERROR(VLOOKUP(J10,#REF!,4,0)),\"\",(VLOOKUP(J10,#REF!,4,0)))","v":""},"JALE YENGİNER AKTAŞ","FORD OTOSAN",11460,null,1]
[4,null,null,"AYŞENUR KARLI","TÜPRAŞ",12726,"-",null,4,"100M.ENG-1-4",{"$f":"IF(ISERROR(VLOOKUP(J11,#REF!,2,0)),\"\",(VLOOKUP(J11,#REF!,2,0)))","v":""},{"$f":"IF(ISERROR(VLOOKUP(J11,#REF!,4,0)),\"\",(VLOOKUP(J11,#REF!,4,0)))","v":""},"BEGÜM CANSU DEMİR","OPET",14991,null,3]
[5,null,null,"BETÜL ÖZYAY","ARÇELİK",12896,8,null,5,"100M.ENG-1-5",{"$f":"IF(ISERROR(VLOOKUP(J12,#REF!,2,0)),\"\",(VLOOKUP(J12,#REF!,2,0)))","v":""},{"$f":"IF(ISERROR(VLOOKUP(J12,#REF!,4,0)),\"\",(VLOOKUP(J12,#REF!,4,0)))","v":""},"ELİF KAYMAK","VKV SAĞLIK KURULUŞLARI","DNS",null,"-"]
[6,null,null,"SEDEF AĞIR","ARÇELİK",13107,"-",null,6,"100M.ENG-1-6",{"$f":"IF(ISERROR(VLOOKUP(J13,#REF!,2,0)),\"\",(VLOOKUP(J13,#REF!,2,0)))","v":""},{"$f":"IF(ISERROR(VLOOKUP(J13,#REF!,4,0)),\"\",(VLOOKUP(J13,#REF!,4,0)))","v":""},"CEMİLE ALİBAŞOĞLU","TOFAŞ","DNF",null,"-"]
[7,null,null,"GİZAY ULUTAŞ","ZER",13426,7,null,7,"100M.ENG-1-7",{"$f":"IF(ISERROR(VLOOKUP(J14,#REF!,2,0)),\"\",(VLOOKUP(J14,#REF!,2,0)))","v":""},{"$f":"IF(ISERROR(VLOOKUP(J14,#REF!,4,0)),\"\",(VLOOKUP(J14,#REF!,4,0)))","v":""},{"$f":"IF(ISERROR(VLOOKUP(J14,#REF!,5,0)),\"\",(VLOOKUP(J14,#REF!,5,0)))","v":""},{"$f":"IF(ISERROR(VLOOKUP(J14,#REF!,6,0)),\"\",(VLOOKUP(J14,#REF!,6,0)))","v":""}]
[8,null,null,"BEGÜM CANSU DEMİR","OPET",14991,6,null,8,"100M.ENG-1-8",{"$f":"IF(ISERROR(VLOOKUP(J15,#REF!,2,0)),\"\",(VLOOKUP(J15,#REF!,2,0)))","v":""},{"$f":"IF(ISERROR(VLOOKUP(J15,#REF!,4,0)),\"\",(VLOOKUP(J15,#REF!,4,0)))","v":""},{"$f":"IF(ISERROR(VLOOKUP(J15,#REF!,5,0)),\"\",(VLOOKUP(J15,#REF!,5,0)))","v":""},{"$f":"IF(ISERROR(VLOOKUP(J15,#REF!,6,0)),\"\",(VLOOKUP(J15,#REF!,6,0)))","v":""}]
["-",null,null,"CEMİLE ALİBAŞOĞLU","TOFAŞ","DNF","-",null,"2. SERİ",null,null,null,"Rüzgar:"]
["-",null,null,"ELİF KAYMAK","VKV SAĞLIK KURULUŞLARI","DNS","-",null,"Kulvar","Formül","Göğüs No","Doğum Tarihi","Adı ve Soyadı","TAKIMI","Elektronik Kronometre","El Kronometre","Seri Geliş"]
["-",null,null,"ÇİĞDEM KABİL ŞİMŞEK","ZER","DNS","-",null,1,"100M.ENG-2-1",{"$f":"IF(ISERROR(VLOOKUP(J18,#REF!,2,0)),\"\",(VLOOKUP(J18,#REF!,2,0)))","v":""},{"$f":"IF(ISERROR(VLOOKUP(J18,#REF!,4,0)),\"\",(VLOOKUP(J18,#REF!,4,0)))","v":""},{"$f":"IF(ISERROR(VLOOKUP(J18,#REF!,5,0)),\"\",(VLOOKUP(J18,#REF!,5,0)))","v":""},{"$f":"IF(ISERROR(VLOOKUP(J18,#REF!,6,0)),\"\",(VLOOKUP(J18,#REF!,6,0)))","v":""}]
["-",null,null,"EDA ERDİK","OPET ","DNS","-",null,2,"100M.ENG-2-2",{"$f":"IF(ISERROR(VLOOKUP(J19,#REF!,2,0)),\"\",(VLOOKUP(J19,#REF!,2,0)))","v":""},{"$f":"IF(ISERROR(VLOOKUP(J19,#REF!,4,0)),\"\",(VLOOKUP(J19,#REF!,4,0)))","v":""},"ESİN YILMAZ","YAPI KREDİ",11719,null,1]
[null,null,null,null,null,null,null,null,3,"100M.ENG-2-3",{"$f":"IF(ISERROR(VLOOKUP(J20,#REF!,2,0)),\"\",(VLOOKUP(J20,#REF!,2,0)))","v":""},{"$f":"IF(ISERROR(VLOOKUP(J20,#REF!,4,0)),\"\",(VLOOKUP(J20,#REF!,4,0)))","v":""},"BETÜL ÖZYAY","ARÇELİK",12896,null,2]
[null,null,null,null,null,null,null,null,4,"100M.ENG-2-4",{"$f":"IF(ISERROR(VLOOKUP(J21,#REF!,2,0)),\"\",(VLOOKUP(J21,#REF!,2,0)))","v":""},{"$f":"IF(ISERROR(VLOOKUP(J21,#REF!,4,0)),\"\",(VLOOKUP(J21,#REF!,4,0)))","v":""}]
[null,null,null,null,null,null,null,null,5,"100M.ENG-2-5",{"$f":"IF(ISERROR(VLOOKUP(J22,#REF!,2,0)),\"\",(VLOOKUP(J22,#REF!,2,0)))","v":""},{"$f":"IF(ISERROR(VLOOKUP(J22,#REF!,4,0)),\"\",(VLOOKUP(J22,#REF!,4,0)))","v":""}]
[null,null,null,null,null,null,null,null,6,"100M.ENG-2-6",{"$f":"IF(ISERROR(VLOOKUP(J23,#REF!,2,0)),\"\",(VLOOKUP(J23,#REF!,2,0)))","v":""},{"$f":"IF(ISERROR(VLOOKUP(J23,#REF!,4,0)),\"\",(VLOOKUP(J23,#REF!,4,0)))","v":""},"ÇİĞDEM KABİL ŞİMŞEK","ZER","DNS",null,"-"]
[null,null,null,null,null,null,null,null,7,"100M.ENG-2-7",{"$f":"IF(ISERROR(VLOOKUP(J24,#REF!,2,0)),\"\",(VLOOKUP(J24,#REF!,2,0)))","v":""},{"$f":"IF(ISERROR(VLOOKUP(J24,#REF!,4,0)),\"\",(VLOOKUP(J24,#REF!,4,0)))","v":""},{"$f":"IF(ISERROR(VLOOKUP(J24,#REF!,5,0)),\"\",(VLOOKUP(J24,#REF!,5,0)))","v":""},{"$f":"IF(ISERROR(VLOOKUP(J24,#REF!,6,0)),\"\",(VLOOKUP(J24,#REF!,6,0)))","v":""}]
[null,null,null,null,null,null,null,null,8,"100M.ENG-2-8",{"$f":"IF(ISERROR(VLOOKUP(J25,#REF!,2,0)),\"\",(VLOOKUP(J25,#REF!,2,0)))","v":""},{"$f":"IF(ISERROR(VLOOKUP(J25,#REF!,4,0)),\"\",(VLOOKUP(J25,#REF!,4,0)))","v":""},{"$f":"IF(ISERROR(VLOOKUP(J25,#REF!,5,0)),\"\",(VLOOKUP(J25,#REF!,5,0)))","v":""},{"$f":"IF(ISERROR(VLOOKUP(J25,#REF!,6,0)),\"\",(VLOOKUP(J25,#REF!,6,0)))","v":""}]
[null,null,null,null,null,null,null,null,"3. SERİ",null,null,null,"Rüzgar:"]
[null,null,null,null,null,null,null,null,"Kulvar","Formül","Göğüs No","Doğum Tarihi","Adı ve Soyadı","Okulu","Elektronik Kronometre","El Kronometre","Seri Geliş"]
[null,null,null,null,null,null,{"$f":"IF(ISTEXT(F28),\" \",IFERROR(VLOOKUP(SMALL(PUAN!$I$4:$J$111,COUNTIF(PUAN!$I$4:$J$111,\"<\"&F28)+1),PUAN!$I$4:$J$111,2,2),\"    \"))","v":"    "},null,1,"100M.ENG-3-1",{"$f":"IF(ISERROR(VLOOKUP(J28,#REF!,2,0)),\"\",(VLOOKUP(J28,#REF!,2,0)))","v":""},{"$f":"IF(ISERROR(VLOOKUP(J28,#REF!,4,0)),\"\",(VLOOKUP(J28,#REF!,4,0)))","v":""},{"$f":"IF(ISERROR(VLOOKUP(J28,#REF!,5,0)),\"\",(VLOOKUP(J28,#REF!,5,0)))","v":""},{"$f":"IF(ISERROR(VLOOKUP(J28,#REF!,6,0)),\"\",(VLOOKUP(J28,#REF!,6,0)))","v":""},{"$f":"IF(IF(OR(P28=\"NM\",P28=\"DNF\",P28=\"DNS\",P28=\"DQ\",P28=\"\"),P28,(ROUNDUP(P28,)+24))=0,\" \",IF(OR(P28=\"NM\",P28=\"DNF\",P28=\"DNS\",P28=\"DQ\",P28=\"\"),P28,(ROUNDUP(P28,)+24)))","v":" "}]
[null,null,null,null,null,null,{"$f":"IF(ISTEXT(F29),\" \",IFERROR(VLOOKUP(SMALL(PUAN!$I$4:$J$111,COUNTIF(PUAN!$I$4:$J$111,\"<\"&F29)+1),PUAN!$I$4:$J$111,2,2),\"    \"))","v":"    "},null,2,"100M.ENG-3-2",{"$f":"IF(ISERROR(VLOOKUP(J29,#REF!,2,0)),\"\",(VLOOKUP(J29,#REF!,2,0)))","v":""},{"$f":"IF(ISERROR(VLOOKUP(J29,#REF!,4,0)),\"\",(VLOOKUP(J29,#REF!,4,0)))","v":""},{"$f":"IF(ISERROR(VLOOKUP(J29,#REF!,5,0)),\"\",(VLOOKUP(J29,#REF!,5,0)))","v":""},{"$f":"IF(ISERROR(VLOOKUP(J29,#REF!,6,0)),\"\",(VLOOKUP(J29,#REF!,6,0)))","v":""}," "]
[null,null,null,null,null,null,{"$f":"IF(ISTEXT(F30),\" \",IFERROR(VLOOKUP(SMALL(PUAN!$I$4:$J$111,COUNTIF(PUAN!$I$4:$J$111,\"<\"&F30)+1),PUAN!$I$4:$J$111,2,2),\"    \"))","v":"    "},null,3,"100M.ENG-3-3",{"$f":"IF(ISERROR(VLOOKUP(J30,#REF!,2,0)),\"\",(VLOOKUP(J30,#REF!,2,0)))","v":""},{"$f":"IF(ISERROR(VLOOKUP(J30,#REF!,4,0)),\"\",(VLOOKUP(J30,#REF!,4,0)))","v":""},"SEDEF AĞIR","ARÇELİK",13107,null,2]
[null,null,null,null,null,null,{"$f":"IF(ISTEXT(F31),\" \",IFERROR(VLOOKUP(SMALL(PUAN!$I$4:$J$111,COUNTIF(PUAN!$I$4:$J$111,\"<\"&F31)+1),PUAN!$I$4:$J$111,2,2),\"    \"))","v":"    "},null,4,"100M.ENG-3-4",{"$f":"IF(ISERROR(VLOOKUP(J31,#REF!,2,0)),\"\",(VLOOKUP(J31,#REF!,2,0)))","v":""},{"$f":"IF(ISERROR(VLOOKUP(J31,#REF!,4,0)),\"\",(VLOOKUP(J31,#REF!,4,0)))","v":""},"EDA ERDİK","OPET ","DNS",null,"-"]
[null,null,null,null,null,null,{"$f":"IF(ISTEXT(F32),\" \",IFERROR(VLOOKUP(SMALL(PUAN!$I$4:$J$111,COUNTIF(PUAN!$I$4:$J$111,\"<\"&F32)+1),PUAN!$I$4:$J$111,2,2),\"    \"))","v":"    "},null,5,"100M.ENG-3-5",{"$f":"IF(ISERROR(VLOOKUP(J32,#REF!,2,0)),\"\",(VLOOKUP(J32,#REF!,2,0)))","v":""},{"$f":"IF(ISERROR(VLOOKUP(J32,#REF!,4,0)),\"\",(VLOOKUP(J32,#REF!,4,0)))","v":""},"AYŞENUR KARLI","TÜPRAŞ",12726,null,1]
[null,null,null,null,null,null,{"$f":"IF(ISTEXT(F33),\" \",IFERROR(VLOOKUP(SMALL(PUAN!$I$4:$J$111,COUNTIF(PUAN!$I$4:$J$111,\"<\"&F33)+1),PUAN!$I$4:$J$111,2,2),\"    \"))","v":"    "},null,6,"100M.ENG-3-6",{"$f":"IF(ISERROR(VLOOKUP(J33,#REF!,2,0)),\"\",(VLOOKUP(J33,#REF!,2,0)))","v":""},{"$f":"IF(ISERROR(VLOOKUP(J33,#REF!,4,0)),\"\",(VLOOKUP(J33,#REF!,4,0)))","v":""},"GİZAY ULUTAŞ","ZER",13426,null,3]
[null,null,null,null,null,null,{"$f":"IF(ISTEXT(F34),\" \",IFERROR(VLOOKUP(SMALL(PUAN!$I$4:$J$111,COUNTIF(PUAN!$I$4:$J$111,\"<\"&F34)+1),PUAN!$I$4:$J$111,2,2),\"    \"))","v":"    "},null,7,"100M.ENG-3-7",{"$f":"IF(ISERROR(VLOOKUP(J34,#REF!,2,0)),\"\",(VLOOKUP(J34,#REF!,2,0)))","v":""},{"$f":"IF(ISERROR(VLOOKUP(J34,#REF!,4,0)),\"\",(VLOOKUP(J34,#REF!,4,0)))","v":""},{"$f":"IF(ISERROR(VLOOKUP(J34,#REF!,5,0)),\"\",(VLOOKUP(J34,#REF!,5,0)))","v":""},{"$f":"IF(ISERROR(VLOOKUP(J34,#REF!,6,0)),\"\",(VLOOKUP(J34,#REF!,6,0)))","v":""}," "]
[null,null,null,null,null,null,{"$f":"IF(ISTEXT(F35),\" \",IFERROR(VLOOKUP(SMALL(PUAN!$I$4:$J$111,COUNTIF(PUAN!$I$4:$J$111,\"<\"&F35)+1),PUAN!$I$4:$J$111,2,2),\"    \"))","v":"    "},null,8,"100M.ENG-3-8",{"$f":"IF(ISERROR(VLOOKUP(J35,#REF!,2,0)),\"\",(VLOOKUP(J35,#REF!,2,0)))","v":""},{"$f":"IF(ISERROR(VLOOKUP(J35,#REF!,4,0)),\"\",(VLOOKUP(J35,#REF!,4,0)))","v":""},{"$f":"IF(ISERROR(VLOOKUP(J35,#REF!,5,0)),\"\",(VLOOKUP(J35,#REF!,5,0)))","v":""},{"$f":"IF(ISERROR(VLOOKUP(J35,#REF!,6,0)),\"\",(VLOOKUP(J35,#REF!,6,0)))","v":""}," "]
[]
["Müsabakalar Direktörü",null,null,null,"Baş Hakem","Lider",null,"Sekreter",null,null,null,null,"Hakem","Hakem",null,"Hakem"]

{"sheet":"100m. Final","index":6,"n_rows":58,"n_cols":17,"rows_kept":58,"cut":false,"hidden":false,"merged":[[5,6,6,6],[3,0,3,2],[3,3,3,4],[3,13,3,16],[4,13,4,16],[5,0,6,0],[5,1,6,1],[5,2,6,2],[5,3,6,3],[5,4,6,4],[5,5,6,5],[0,0,0,16],[1,0,1,16],[2,0,2,2],[2,3,2,4],[2,5,2,6],[2,8,2,10],[2,13,2,16]]}
[]
[{"$f":"'YARIŞMA BİLGİLERİ'!F19","v":"KOÇ TOPLULUĞU SPOR ŞENLİĞİ PUANLI ATLETİZM YARIŞLARI"}]
["Yarışma :",null,null,{"$f":"'YARIŞMA PROGRAMI'!C7","v":"100 Metre"},null,null,null,":"]
["Kategori :",null,null,{"$f":"'YARIŞMA BİLGİLERİ'!F21","v":"Kadınlar"},null,null,null,null,null,null,null,null,"Tarih-Saat :",{"$f":"'YARIŞMA PROGRAMI'!B15","v":"15 Nisan 2017 - 14:14"}]
[null,null,null,null,null,null,null,null,null,null,null,null,null,{"$f":"NOW()","v":42842.612082291664}]
["Sıra No","Göğüs No","Doğum Tarihi\nGün/Ay/Yıl","Adı ve Soyadı","TAKIMI","Derece","Puan",null,"1. SERİ",null,null,null,"Rüzgar:","+0.8"]
[null,null,null,null,null,null,null,null,"Kulvar","Formül","Göğüs No","Doğum Tarihi","Adı ve Soyadı","TAKIMI","Elektronik Kronometre","El Kronometre","Seri Geliş"]
[1,null,null,"CANAN FİL","FORD OTOSAN",1430,null,null,1,"100M-1-1",{"$f":"IF(ISERROR(VLOOKUP(J8,#REF!,2,0)),\"\",(VLOOKUP(J8,#REF!,2,0)))","v":""},{"$f":"IF(ISERROR(VLOOKUP(J8,#REF!,4,0)),\"\",(VLOOKUP(J8,#REF!,4,0)))","v":""},{"$f":"IF(ISERROR(VLOOKUP(J8,#REF!,5,0)),\"\",(VLOOKUP(J8,#REF!,5,0)))","v":""},{"$f":"IF(ISERROR(VLOOKUP(J8,#REF!,6,0)),\"\",(VLOOKUP(J8,#REF!,6,0)))","v":""}]
[2,null,null,"ECEM ERERMİŞ","TÜPRAŞ",1627,null,null,2,"100M-1-2",null,{"$f":"IF(ISERROR(VLOOKUP(J9,#REF!,4,0)),\"\",(VLOOKUP(J9,#REF!,4,0)))","v":""}]
[3,null,null,"SİNEM BAŞ","TÜPRAŞ",1639,null,null,3,"100M-1-3",2,{"$f":"IF(ISERROR(VLOOKUP(J10,#REF!,4,0)),\"\",(VLOOKUP(J10,#REF!,4,0)))","v":""},"CANAN FİL","FORD OTOSAN",1430,null,1]
[4,null,null,"YELİZ ÜNEL","FORD OTOSAN",1675,null,null,4,"100M-1-4",3,{"$f":"IF(ISERROR(VLOOKUP(J11,#REF!,4,0)),\"\",(VLOOKUP(J11,#REF!,4,0)))","v":""},"KADER GÜNGÖR","OPET","DNS",null,"-"]
[5,null,null,"AYLİN ÖZDEMİR","YAPI KREDİ",1711,null,null,5,"100M-1-5",4,{"$f":"IF(ISERROR(VLOOKUP(J12,#REF!,4,0)),\"\",(VLOOKUP(J12,#REF!,4,0)))","v":""},"YASEMİN ÇORAKLI","VKV SAĞLIK KURULUŞLARI","DNS",null,"-"]
[6,null,null,"ESİN KORKUT","ARÇELİK",1736,null,null,6,"100M-1-6",5,{"$f":"IF(ISERROR(VLOOKUP(J13,#REF!,4,0)),\"\",(VLOOKUP(J13,#REF!,4,0)))","v":""},"RUKİYE DİNDAR","TOFAŞ",1932,null,2]
[7,null,null,"BURCU UMAY","YAPI KREDİ",1772,null,null,7,"100M-1-7",{"$f":"IF(ISERROR(VLOOKUP(J14,#REF!,2,0)),\"\",(VLOOKUP(J14,#REF!,2,0)))","v":""},{"$f":"IF(ISERROR(VLOOKUP(J14,#REF!,4,0)),\"\",(VLOOKUP(J14,#REF!,4,0)))","v":""},{"$f":"IF(ISERROR(VLOOKUP(J14,#REF!,5,0)),\"\",(VLOOKUP(J14,#REF!,5,0)))","v":""},{"$f":"IF(ISERROR(VLOOKUP(J14,#REF!,6,0)),\"\",(VLOOKUP(J14,#REF!,6,0)))","v":""}]
[8,null,null,"FULYA SOYER","TÜPRAŞ",1844,null,null,8,"100M-1-8",{"$f":"IF(ISERROR(VLOOKUP(J15,#REF!,2,0)),\"\",(VLOOKUP(J15,#REF!,2,0)))","v":""},{"$f":"IF(ISERROR(VLOOKUP(J15,#REF!,4,0)),\"\",(VLOOKUP(J15,#REF!,4,0)))","v":""},{"$f":"IF(ISERROR(VLOOKUP(J15,#REF!,5,0)),\"\",(VLOOKUP(J15,#REF!,5,0)))","v":""},{"$f":"IF(ISERROR(VLOOKUP(J15,#REF!,6,0)),\"\",(VLOOKUP(J15,#REF!,6,0)))","v":""}]
[9,null,null,"MERVE AKIN","YAPI KREDİ",1878,null,null,"2. SERİ",null,null,null,"Rüzgar:","+0.9"]
[10,null,null,"ÖZLEM KURT","ZER",1895,null,null,"Kulvar","Formül","Göğüs No","Doğum Tarihi","Adı ve Soyadı","TAKIMI","Elektronik Kronometre","El Kronometre","Seri Geliş"]
[11,null,null,"BURCU FERDA YILMAZ","YAPI KREDİ",1931,null,null,1,"100M-2-1",{"$f":"IF(ISERROR(VLOOKUP(J18,#REF!,2,0)),\"\",(VLOOKUP(J18,#REF!,2,0)))","v":""},{"$f":"IF(ISERROR(VLOOKUP(J18,#REF!,4,0)),\"\",(VLOOKUP(J18,#REF!,4,0)))","v":""},{"$f":"IF(ISERROR(VLOOKUP(J18,#REF!,5,0)),\"\",(VLOOKUP(J18,#REF!,5,0)))","v":""},{"$f":"IF(ISERROR(VLOOKUP(J18,#REF!,6,0)),\"\",(VLOOKUP(J18,#REF!,6,0)))","v":""}]
[12,null,null,"RUKİYE DİNDAR","TOFAŞ",1932,null,null,2,"100M-2-2",6,{"$f":"IF(ISERROR(VLOOKUP(J19,#REF!,4,0)),\"\",(VLOOKUP(J19,#REF!,4,0)))","v":""},"BURCU UMAY","YAPI KREDİ",1772,null,3]
["-",null,null,"KADER GÜNGÖR","OPET","DNS",null,null,3,"100M-2-3",7,{"$f":"IF(ISERROR(VLOOKUP(J20,#REF!,4,0)),\"\",(VLOOKUP(J20,#REF!,4,0)))","v":""},"ESİN KORKUT","ARÇELİK",1736,null,2]
["-",null,null,"YASEMİN ÇORAKLI","VKV SAĞLIK KURULUŞLARI","DNS",null,null,4,"100M-2-4",null,{"$f":"IF(ISERROR(VLOOKUP(J21,#REF!,4,0)),\"\",(VLOOKUP(J21,#REF!,4,0)))","v":""},""]
["-",null,null,"YETER GÜNGÖR","OPET","DNS",null,null,5,"100M-2-5",9,{"$f":"IF(ISERROR(VLOOKUP(J22,#REF!,4,0)),\"\",(VLOOKUP(J22,#REF!,4,0)))","v":""},"SİNEM BAŞ","TÜPRAŞ",1639,null,1]
["-",null,null,"DEMET DURMUŞ","YAPI KREDİ","DNS",null,null,6,"100M-2-6",10,{"$f":"IF(ISERROR(VLOOKUP(J23,#REF!,4,0)),\"\",(VLOOKUP(J23,#REF!,4,0)))","v":""},"ÖZLEM KURT","ZER",1895,null,4]
["-",null,null,"DUYGU CESUR BOLAT","OPET","DNS",null,null,7,"100M-2-7",{"$f":"IF(ISERROR(VLOOKUP(J24,#REF!,2,0)),\"\",(VLOOKUP(J24,#REF!,2,0)))","v":""},{"$f":"IF(ISERROR(VLOOKUP(J24,#REF!,4,0)),\"\",(VLOOKUP(J24,#REF!,4,0)))","v":""},{"$f":"IF(ISERROR(VLOOKUP(J24,#REF!,5,0)),\"\",(VLOOKUP(J24,#REF!,5,0)))","v":""},{"$f":"IF(ISERROR(VLOOKUP(J24,#REF!,6,0)),\"\",(VLOOKUP(J24,#REF!,6,0)))","v":""}]
[null,null,null,null,null,null,null,null,8,"100M-2-8",{"$f":"IF(ISERROR(VLOOKUP(J25,#REF!,2,0)),\"\",(VLOOKUP(J25,#REF!,2,0)))","v":""},{"$f":"IF(ISERROR(VLOOKUP(J25,#REF!,4,0)),\"\",(VLOOKUP(J25,#REF!,4,0)))","v":""},{"$f":"IF(ISERROR(VLOOKUP(J25,#REF!,5,0)),\"\",(VLOOKUP(J25,#REF!,5,0)))","v":""},{"$f":"IF(ISERROR(VLOOKUP(J25,#REF!,6,0)),\"\",(VLOOKUP(J25,#REF!,6,0)))","v":""}]
[null,null,null,null,null,null,null,null,"3. SERİ",null,null,null,"Rüzgar:","-2.0"]
[null,null,null,null,null,null,null,null,"Kulvar","Formül","Göğüs No","Doğum Tarihi","Adı ve Soyadı","TAKIMI","Elektronik Kronometre","El Kronometre","Seri Geliş"]
[null,null,null,null,null,null,null,null,1,"100M-3-1",{"$f":"IF(ISERROR(VLOOKUP(J28,#REF!,2,0)),\"\",(VLOOKUP(J28,#REF!,2,0)))","v":""},{"$f":"IF(ISERROR(VLOOKUP(J28,#REF!,4,0)),\"\",(VLOOKUP(J28,#REF!,4,0)))","v":""},{"$f":"IF(ISERROR(VLOOKUP(J28,#REF!,5,0)),\"\",(VLOOKUP(J28,#REF!,5,0)))","v":""},{"$f":"IF(ISERROR(VLOOKUP(J28,#REF!,6,0)),\"\",(VLOOKUP(J28,#REF!,6,0)))","v":""},"      "]
[null,null,null,null,null,null,null,null,2,"100M-3-2",11,{"$f":"IF(ISERROR(VLOOKUP(J29,#REF!,4,0)),\"\",(VLOOKUP(J29,#REF!,4,0)))","v":""},"AYLİN ÖZDEMİR","YAPI KREDİ",1711,null,3]
[null,null,null,null,null,null,null,null,3,"100M-3-3",12,{"$f":"IF(ISERROR(VLOOKUP(J30,#REF!,4,0)),\"\",(VLOOKUP(J30,#REF!,4,0)))","v":""},"YELİZ ÜNEL","FORD OTOSAN",1675,null,2]
[null,null,null,null,null,null,null,null,4,"100M-3-4",13,{"$f":"IF(ISERROR(VLOOKUP(J31,#REF!,4,0)),\"\",(VLOOKUP(J31,#REF!,4,0)))","v":""},"YETER GÜNGÖR","OPET","DNS",null,"-"]
[null,null,null,null,null,null,null,null,5,"100M-3-5",{"$f":"IF(ISERROR(VLOOKUP(J32,#REF!,2,0)),\"\",(VLOOKUP(J32,#REF!,2,0)))","v":""},{"$f":"IF(ISERROR(VLOOKUP(J32,#REF!,4,0)),\"\",(VLOOKUP(J32,#REF!,4,0)))","v":""},"ECEM ERERMİŞ","TÜPRAŞ",1627,null,1]
[null,null,null,null,null,null,null,null,6,"100M-3-6",{"$f":"IF(ISERROR(VLOOKUP(J33,#REF!,2,0)),\"\",(VLOOKUP(J33,#REF!,2,0)))","v":""},{"$f":"IF(ISERROR(VLOOKUP(J33,#REF!,4,0)),\"\",(VLOOKUP(J33,#REF!,4,0)))","v":""},{"$f":"IF(ISERROR(VLOOKUP(J33,#REF!,5,0)),\"\",(VLOOKUP(J33,#REF!,5,0)))","v":""},{"$f":"IF(ISERROR(VLOOKUP(J33,#REF!,6,0)),\"\",(VLOOKUP(J33,#REF!,6,0)))","v":""}]
[null,null,null,null,null,null,null,null,7,"100M-3-7",{"$f":"IF(ISERROR(VLOOKUP(J34,#REF!,2,0)),\"\",(VLOOKUP(J34,#REF!,2,0)))","v":""},{"$f":"IF(ISERROR(VLOOKUP(J34,#REF!,4,0)),\"\",(VLOOKUP(J34,#REF!,4,0)))","v":""},{"$f":"IF(ISERROR(VLOOKUP(J34,#REF!,5,0)),\"\",(VLOOKUP(J34,#REF!,5,0)))","v":""},{"$f":"IF(ISERROR(VLOOKUP(J34,#REF!,6,0)),\"\",(VLOOKUP(J34,#REF!,6,0)))","v":""}]
[null,null,null,null,null,null,null,null,8,"100M-3-8",{"$f":"IF(ISERROR(VLOOKUP(J35,#REF!,2,0)),\"\",(VLOOKUP(J35,#REF!,2,0)))","v":""},{"$f":"IF(ISERROR(VLOOKUP(J35,#REF!,4,0)),\"\",(VLOOKUP(J35,#REF!,4,0)))","v":""},{"$f":"IF(ISERROR(VLOOKUP(J35,#REF!,5,0)),\"\",(VLOOKUP(J35,#REF!,5,0)))","v":""},{"$f":"IF(ISERROR(VLOOKUP(J35,#REF!,6,0)),\"\",(VLOOKUP(J35,#REF!,6,0)))","v":""}]
[null,null,null,null,null,null,null,null,"4. SERİ",null,null,null,"Rüzgar:","-2.0"]
[null,null,null,null,null,null,null,null,"Kulvar","Formül","Göğüs No","Doğum Tarihi","Adı ve Soyadı","TAKIMI","Elektronik Kronometre","Derece","Seri Geliş"]
[null,null,null,null,null,null,null,null,1,"100M-4-1",{"$f":"IF(ISERROR(VLOOKUP(J38,#REF!,2,0)),\"\",(VLOOKUP(J38,#REF!,2,0)))","v":""},{"$f":"IF(ISERROR(VLOOKUP(J38,#REF!,4,0)),\"\",(VLOOKUP(J38,#REF!,4,0)))","v":""},{"$f":"IF(ISERROR(VLOOKUP(J38,#REF!,5,0)),\"\",(VLOOKUP(J38,#REF!,5,0)))","v":""},{"$f":"IF(ISERROR(VLOOKUP(J38,#REF!,6,0)),\"\",(VLOOKUP(J38,#REF!,6,0)))","v":""},{"$f":"IF(IF(OR(P38=\"NM\",P38=\"DNF\",P38=\"DNS\",P38=\"DQ\",P38=\"\"),P38,(ROUNDUP(P38,)+24))=0,\" \",IF(OR(P38=\"NM\",P38=\"DNF\",P38=\"DNS\",P38=\"DQ\",P38=\"\"),P38,(ROUNDUP(P38,)+24)))","v":" "}]
[null,null,null,null,null,null,null,null,2,"100M-4-2",14,{"$f":"IF(ISERROR(VLOOKUP(J39,#REF!,4,0)),\"\",(VLOOKUP(J39,#REF!,4,0)))","v":""},"MERVE AKIN","YAPI KREDİ",1878,null,2]
[null,null,null,null,null,null,null,null,3,"100M-4-3",15,{"$f":"IF(ISERROR(VLOOKUP(J40,#REF!,4,0)),\"\",(VLOOKUP(J40,#REF!,4,0)))","v":""},"DEMET DURMUŞ","YAPI KREDİ","DNS",null,"-"]
[null,null,null,null,null,null,null,null,4,"100M-4-4",16,{"$f":"IF(ISERROR(VLOOKUP(J41,#REF!,4,0)),\"\",(VLOOKUP(J41,#REF!,4,0)))","v":""},"DUYGU CESUR BOLAT","OPET","DNS",null,"-"]
[null,null,null,null,null,null,null,null,5,"100M-4-5",17,{"$f":"IF(ISERROR(VLOOKUP(J42,#REF!,4,0)),\"\",(VLOOKUP(J42,#REF!,4,0)))","v":""},"FULYA SOYER","TÜPRAŞ",1844,null,1]
[null,null,null,null,null,null,null,null,6,"100M-4-6",18,{"$f":"IF(ISERROR(VLOOKUP(J43,#REF!,4,0)),\"\",(VLOOKUP(J43,#REF!,4,0)))","v":""},"BURCU FERDA YILMAZ","YAPI KREDİ",1931,null,3]
[null,null,null,null,null,null,null,null,7,"100M-4-7",{"$f":"IF(ISERROR(VLOOKUP(J44,#REF!,2,0)),\"\",(VLOOKUP(J44,#REF!,2,0)))","v":""},{"$f":"IF(ISERROR(VLOOKUP(J44,#REF!,4,0)),\"\",(VLOOKUP(J44,#REF!,4,0)))","v":""},{"$f":"IF(ISERROR(VLOOKUP(J44,#REF!,5,0)),\"\",(VLOOKUP(J44,#REF!,5,0)))","v":""},{"$f":"IF(ISERROR(VLOOKUP(J44,#REF!,6,0)),\"\",(VLOOKUP(J44,#REF!,6,0)))","v":""}]
[null,null,null,null,null,null,null,null,8,"100M-4-8",{"$f":"IF(ISERROR(VLOOKUP(J45,#REF!,2,0)),\"\",(VLOOKUP(J45,#REF!,2,0)))","v":""},{"$f":"IF(ISERROR(VLOOKUP(J45,#REF!,4,0)),\"\",(VLOOKUP(J45,#REF!,4,0)))","v":""},{"$f":"IF(ISERROR(VLOOKUP(J45,#REF!,5,0)),\"\",(VLOOKUP(J45,#REF!,5,0)))","v":""},{"$f":"IF(ISERROR(VLOOKUP(J45,#REF!,6,0)),\"\",(VLOOKUP(J45,#REF!,6,0)))","v":""}]
[]
[null,null,null,null,null,null,{"$f":"IF(ISTEXT(F47),\" \",IFERROR(VLOOKUP(SMALL(PUAN!$A$6:$F$111,COUNTIF(PUAN!$A$6:$F$111,\"<\"&F47)+1),PUAN!$A$6:$F$111,4,0),\"    \"))","v":"    "},null,"5. SERİ",null,null,null,"Rüzgar:"]
[null,null,null,null,null,null,{"$f":"IF(ISTEXT(F48),\" \",IFERROR(VLOOKUP(SMALL(PUAN!$A$6:$F$111,COUNTIF(PUAN!$A$6:$F$111,\"<\"&F48)+1),PUAN!$A$6:$F$111,4,0),\"    \"))","v":"    "},null,"Kulvar","Formül","Göğüs No","Doğum Tarihi","Adı ve Soyadı","Okulu","Elektronik Kronometre","El Kronometre","Seri Geliş"]
[null,null,null,null,null,null,{"$f":"IF(ISTEXT(F49),\" \",IFERROR(VLOOKUP(SMALL(PUAN!$A$6:$F$111,COUNTIF(PUAN!$A$6:$F$111,\"<\"&F49)+1),PUAN!$A$6:$F$111,4,0),\"    \"))","v":"    "},null,1,"100M-5-1",{"$f":"IF(ISERROR(VLOOKUP(J49,#REF!,2,0)),\"\",(VLOOKUP(J49,#REF!,2,0)))","v":""},{"$f":"IF(ISERROR(VLOOKUP(J49,#REF!,4,0)),\"\",(VLOOKUP(J49,#REF!,4,0)))","v":""},{"$f":"IF(ISERROR(VLOOKUP(J49,#REF!,5,0)),\"\",(VLOOKUP(J49,#REF!,5,0)))","v":""},{"$f":"IF(ISERROR(VLOOKUP(J49,#REF!,6,0)),\"\",(VLOOKUP(J49,#REF!,6,0)))","v":""}]
[null,null,null,null,null,null,{"$f":"IF(ISTEXT(F50),\" \",IFERROR(VLOOKUP(SMALL(PUAN!$A$6:$F$111,COUNTIF(PUAN!$A$6:$F$111,\"<\"&F50)+1),PUAN!$A$6:$F$111,4,0),\"    \"))","v":"    "},null,2,"100M-5-2",{"$f":"IF(ISERROR(VLOOKUP(J50,#REF!,2,0)),\"\",(VLOOKUP(J50,#REF!,2,0)))","v":""},{"$f":"IF(ISERROR(VLOOKUP(J50,#REF!,4,0)),\"\",(VLOOKUP(J50,#REF!,4,0)))","v":""}]
[null,null,null,null,null,null,{"$f":"IF(ISTEXT(F51),\" \",IFERROR(VLOOKUP(SMALL(PUAN!$A$6:$F$111,COUNTIF(PUAN!$A$6:$F$111,\"<\"&F51)+1),PUAN!$A$6:$F$111,4,0),\"    \"))","v":"    "},null,3,"100M-5-3",{"$f":"IF(ISERROR(VLOOKUP(J51,#REF!,2,0)),\"\",(VLOOKUP(J51,#REF!,2,0)))","v":""},{"$f":"IF(ISERROR(VLOOKUP(J51,#REF!,4,0)),\"\",(VLOOKUP(J51,#REF!,4,0)))","v":""}]
[null,null,null,null,null,null,{"$f":"IF(ISTEXT(F52),\" \",IFERROR(VLOOKUP(SMALL(PUAN!$A$6:$F$111,COUNTIF(PUAN!$A$6:$F$111,\"<\"&F52)+1),PUAN!$A$6:$F$111,4,0),\"    \"))","v":"    "},null,4,"100M-5-4",{"$f":"IF(ISERROR(VLOOKUP(J52,#REF!,2,0)),\"\",(VLOOKUP(J52,#REF!,2,0)))","v":""},{"$f":"IF(ISERROR(VLOOKUP(J52,#REF!,4,0)),\"\",(VLOOKUP(J52,#REF!,4,0)))","v":""},{"$f":"IF(ISERROR(VLOOKUP(J52,#REF!,5,0)),\"\",(VLOOKUP(J52,#REF!,5,0)))","v":""},{"$f":"IF(ISERROR(VLOOKUP(J52,#REF!,6,0)),\"\",(VLOOKUP(J52,#REF!,6,0)))","v":""}]
[null,null,null,null,null,null,{"$f":"IF(ISTEXT(F53),\" \",IFERROR(VLOOKUP(SMALL(PUAN!$A$6:$F$111,COUNTIF(PUAN!$A$6:$F$111,\"<\"&F53)+1),PUAN!$A$6:$F$111,4,0),\"    \"))","v":"    "},null,5,"100M-5-5",{"$f":"IF(ISERROR(VLOOKUP(J53,#REF!,2,0)),\"\",(VLOOKUP(J53,#REF!,2,0)))","v":""},{"$f":"IF(ISERROR(VLOOKUP(J53,#REF!,4,0)),\"\",(VLOOKUP(J53,#REF!,4,0)))","v":""}]
[null,null,null,null,null,null,{"$f":"IF(ISTEXT(F54),\" \",IFERROR(VLOOKUP(SMALL(PUAN!$A$6:$F$111,COUNTIF(PUAN!$A$6:$F$111,\"<\"&F54)+1),PUAN!$A$6:$F$111,4,0),\"    \"))","v":"    "},null,6,"100M-5-6",{"$f":"IF(ISERROR(VLOOKUP(J54,#REF!,2,0)),\"\",(VLOOKUP(J54,#REF!,2,0)))","v":""},{"$f":"IF(ISERROR(VLOOKUP(J54,#REF!,4,0)),\"\",(VLOOKUP(J54,#REF!,4,0)))","v":""},{"$f":"IF(ISERROR(VLOOKUP(J54,#REF!,5,0)),\"\",(VLOOKUP(J54,#REF!,5,0)))","v":""},{"$f":"IF(ISERROR(VLOOKUP(J54,#REF!,6,0)),\"\",(VLOOKUP(J54,#REF!,6,0)))","v":""}]
[null,null,null,null,null,null,{"$f":"IF(ISTEXT(F55),\" \",IFERROR(VLOOKUP(SMALL(PUAN!$A$6:$F$111,COUNTIF(PUAN!$A$6:$F$111,\"<\"&F55)+1),PUAN!$A$6:$F$111,4,0),\"    \"))","v":"    "},null,7,"100M-5-7",{"$f":"IF(ISERROR(VLOOKUP(J55,#REF!,2,0)),\"\",(VLOOKUP(J55,#REF!,2,0)))","v":""},{"$f":"IF(ISERROR(VLOOKUP(J55,#REF!,4,0)),\"\",(VLOOKUP(J55,#REF!,4,0)))","v":""},{"$f":"IF(ISERROR(VLOOKUP(J55,#REF!,5,0)),\"\",(VLOOKUP(J55,#REF!,5,0)))","v":""},{"$f":"IF(ISERROR(VLOOKUP(J55,#REF!,6,0)),\"\",(VLOOKUP(J55,#REF!,6,0)))","v":""}]
[null,null,null,null,null,null,{"$f":"IF(ISTEXT(F56),\" \",IFERROR(VLOOKUP(SMALL(PUAN!$A$6:$F$111,COUNTIF(PUAN!$A$6:$F$111,\"<\"&F56)+1),PUAN!$A$6:$F$111,4,0),\"    \"))","v":"    "},null,8,"100M-5-8",{"$f":"IF(ISERROR(VLOOKUP(J56,#REF!,2,0)),\"\",(VLOOKUP(J56,#REF!,2,0)))","v":""},{"$f":"IF(ISERROR(VLOOKUP(J56,#REF!,4,0)),\"\",(VLOOKUP(J56,#REF!,4,0)))","v":""},{"$f":"IF(ISERROR(VLOOKUP(J56,#REF!,5,0)),\"\",(VLOOKUP(J56,#REF!,5,0)))","v":""},{"$f":"IF(ISERROR(VLOOKUP(J56,#REF!,6,0)),\"\",(VLOOKUP(J56,#REF!,6,0)))","v":""},{"$f":"IF(IF(OR(P56=\"NM\",P56=\"DNF\",P56=\"DNS\",P56=\"DQ\",P56=\"\"),P56,(ROUNDUP(P56,)+24))=0,\" \",IF(OR(P56=\"NM\",P56=\"DNF\",P56=\"DNS\",P56=\"DQ\",P56=\"\"),P56,(ROUNDUP(P56,)+24)))","v":" "}]
[]
["Müsabakalar Direktörü",null,null,null,"Baş Hakem","Lider",null,"Sekreter",null,null,null,null,"Hakem","Hakem",null,"Hakem"]

{"sheet":"800m.","index":7,"n_rows":42,"n_cols":17,"rows_kept":42,"cut":false,"hidden":false,"merged":[[0,0,0,16],[1,0,1,16],[2,0,2,2],[2,3,2,4],[2,5,2,6],[2,13,2,16],[5,5,6,5],[5,2,6,2],[5,3,6,3],[2,8,2,10],[4,13,4,16],[5,6,6,6],[3,13,3,16],[3,0,3,2],[3,3,3,4],[5,0,6,0],[5,1,6,1],[5,4,6,4]]}
[]
[{"$f":"'YARIŞMA BİLGİLERİ'!F19","v":"KOÇ TOPLULUĞU SPOR ŞENLİĞİ PUANLI ATLETİZM YARIŞLARI"}]
["Yarışma :",null,null,{"$f":"'YARIŞMA PROGRAMI'!C9","v":"800 Metre"},null,null,null,":"]
["Kategori :",null,null,{"$f":"'YARIŞMA BİLGİLERİ'!F21","v":"Kadınlar"},null,null,null,null,null,null,null,null,"Tarih-Saat ",{"$f":"'YARIŞMA PROGRAMI'!B9","v":"2017-04-15T15:15:00"}]
[null,null,null,null,null,null,null,null,null,null,null,null,null,{"$f":"NOW()","v":42842.612082291664}]
["Sıra No","Göğüs No","Doğum Tarihi\nGün/Ay/Yıl","Adı ve Soyadı","Okulu","Derece","Puan",null,"1. SERİ"]
[null,null,null,null,null,null,null,null,"Kulvar","Formül","Göğüs No","Doğum Tarihi","Adı ve Soyadı","Okulu","Elektronik Kronometre","El Kronometre","Seri Geliş"]
[1,null,null,"SEMA KUNUK","FORD OTOSAN",30026,11,null,1,"800M-1-1",{"$f":"IF(ISERROR(VLOOKUP(J8,#REF!,2,0)),\"\",(VLOOKUP(J8,#REF!,2,0)))","v":""},{"$f":"IF(ISERROR(VLOOKUP(J8,#REF!,4,0)),\"\",(VLOOKUP(J8,#REF!,4,0)))","v":""},{"$f":"IF(ISERROR(VLOOKUP(J8,#REF!,5,0)),\"\",(VLOOKUP(J8,#REF!,5,0)))","v":""}]
[2,null,null,"DEMET OĞUZTÜRK","YAPI KREDİ",32491,10,null,2,"800M-1-2",{"$f":"IF(ISERROR(VLOOKUP(J9,#REF!,2,0)),\"\",(VLOOKUP(J9,#REF!,2,0)))","v":""},{"$f":"IF(ISERROR(VLOOKUP(J9,#REF!,4,0)),\"\",(VLOOKUP(J9,#REF!,4,0)))","v":""},""]
[3,null,null,"ZEYNEP DÜZGÖREN","TÜPRAŞ",33081,9,null,2,null,53,null,"DEMET OĞUZTÜRK","YAPI KREDİ",32491,null,2]
[4,null,null,"SİMGE TARKUÇ","ARÇELİK",34494,8,null,3,"800M-1-3",54,{"$f":"IF(ISERROR(VLOOKUP(J11,#REF!,4,0)),\"\",(VLOOKUP(J11,#REF!,4,0)))","v":""},"SEMA KUNUK","FORD OTOSAN",30026,null,1]
[5,null,null,"SERAP YÜKSEK","TOFAŞ",34973,7,null,3,null,55,null,"SİMGE TARKUÇ","ARÇELİK",34494,null,4]
[6,null,null,"SEDA KARAKOÇ","ZER",35879,6,null,4,"800M-1-4","-",{"$f":"IF(ISERROR(VLOOKUP(J13,#REF!,4,0)),\"\",(VLOOKUP(J13,#REF!,4,0)))","v":""},"AYCAN VAROL","OPET","DNS",null,"-"]
["-",null,null,"AYCAN VAROL","OPET","DNS","-",null,5,"800M-1-5","-",{"$f":"IF(ISERROR(VLOOKUP(J14,#REF!,4,0)),\"\",(VLOOKUP(J14,#REF!,4,0)))","v":""},"AHI DAMLA KAYTAN","VKV SAĞLIK KURULUŞLARI","DNS",null,"-"]
["-",null,null,"AHI DAMLA KAYTAN","VKV SAĞLIK KURULUŞLARI","DNS","-",null,5,null,57,null,"ZEYNEP DÜZGÖREN","TÜPRAŞ",33081,null,3]
["-",null,null,"ZEYNEP ERPOLAT","ARÇELİK","DNS","-",null,6,"800M-1-6",56,{"$f":"IF(ISERROR(VLOOKUP(J16,#REF!,4,0)),\"\",(VLOOKUP(J16,#REF!,4,0)))","v":""},"SERAP YÜKSEK","TOFAŞ",34973,null,5]
["-",null,null,"ÜLKÜ BİRİŞİK ATEŞ","ZER","DNS","-",null,6,"800M-1-7",58,{"$f":"IF(ISERROR(VLOOKUP(J17,#REF!,4,0)),\"\",(VLOOKUP(J17,#REF!,4,0)))","v":""},"SEDA KARAKOÇ","ZER",35879,null,6]
[null,null,null,null,null,null,null,null,7,null,"-",null,"ZEYNEP ERPOLAT","ARÇELİK","DNS",null,"-"]
[null,null,null,null,null,null,null,null,7,null,"-",null,"ÜLKÜ BİRİŞİK ATEŞ","ZER","DNS",null,"-"]
[null,null,null,null,null,null,null,null,8,"800M-1-8",{"$f":"IF(ISERROR(VLOOKUP(J20,#REF!,2,0)),\"\",(VLOOKUP(J20,#REF!,2,0)))","v":""},{"$f":"IF(ISERROR(VLOOKUP(J20,#REF!,4,0)),\"\",(VLOOKUP(J20,#REF!,4,0)))","v":""},{"$f":"IF(ISERROR(VLOOKUP(J20,#REF!,5,0)),\"\",(VLOOKUP(J20,#REF!,5,0)))","v":""},{"$f":"IF(ISERROR(VLOOKUP(J20,#REF!,6,0)),\"\",(VLOOKUP(J20,#REF!,6,0)))","v":""}]
[null,null,null,null,null,null,null,null,"2. SERİ"]
[null,null,null,null,null,null,null,null,"Kulvar","Formül","Göğüs No","Doğum Tarihi","Adı ve Soyadı","Okulu","Elektronik Kronometre","El Kronometre","Seri Geliş"]
[null,null,null,null,null,null,null,null,1,"800M-2-1",{"$f":"IF(ISERROR(VLOOKUP(J23,#REF!,2,0)),\"\",(VLOOKUP(J23,#REF!,2,0)))","v":""},{"$f":"IF(ISERROR(VLOOKUP(J23,#REF!,4,0)),\"\",(VLOOKUP(J23,#REF!,4,0)))","v":""},{"$f":"IF(ISERROR(VLOOKUP(J23,#REF!,5,0)),\"\",(VLOOKUP(J23,#REF!,5,0)))","v":""},{"$f":"IF(ISERROR(VLOOKUP(J23,#REF!,6,0)),\"\",(VLOOKUP(J23,#REF!,6,0)))","v":""}]
[null,null,null,null,null,null,null,null,2,"800M-2-2",{"$f":"IF(ISERROR(VLOOKUP(J24,#REF!,2,0)),\"\",(VLOOKUP(J24,#REF!,2,0)))","v":""},{"$f":"IF(ISERROR(VLOOKUP(J24,#REF!,4,0)),\"\",(VLOOKUP(J24,#REF!,4,0)))","v":""}]
[null,null,null,null,null,null,null,null,3,"800M-2-3",{"$f":"IF(ISERROR(VLOOKUP(J25,#REF!,2,0)),\"\",(VLOOKUP(J25,#REF!,2,0)))","v":""},{"$f":"IF(ISERROR(VLOOKUP(J25,#REF!,4,0)),\"\",(VLOOKUP(J25,#REF!,4,0)))","v":""}]
[null,null,null,null,null,null,null,null,4,"800M-2-4",{"$f":"IF(ISERROR(VLOOKUP(J26,#REF!,2,0)),\"\",(VLOOKUP(J26,#REF!,2,0)))","v":""},{"$f":"IF(ISERROR(VLOOKUP(J26,#REF!,4,0)),\"\",(VLOOKUP(J26,#REF!,4,0)))","v":""}]
[null,null,null,null,null,null,null,null,5,"800M-2-5",{"$f":"IF(ISERROR(VLOOKUP(J27,#REF!,2,0)),\"\",(VLOOKUP(J27,#REF!,2,0)))","v":""},{"$f":"IF(ISERROR(VLOOKUP(J27,#REF!,4,0)),\"\",(VLOOKUP(J27,#REF!,4,0)))","v":""}]
[null,null,null,null,null,null,null,null,6,"800M-2-6",{"$f":"IF(ISERROR(VLOOKUP(J28,#REF!,2,0)),\"\",(VLOOKUP(J28,#REF!,2,0)))","v":""},{"$f":"IF(ISERROR(VLOOKUP(J28,#REF!,4,0)),\"\",(VLOOKUP(J28,#REF!,4,0)))","v":""}]
[null,null,null,null,null,null,null,null,7,"800M-2-7",{"$f":"IF(ISERROR(VLOOKUP(J29,#REF!,2,0)),\"\",(VLOOKUP(J29,#REF!,2,0)))","v":""},{"$f":"IF(ISERROR(VLOOKUP(J29,#REF!,4,0)),\"\",(VLOOKUP(J29,#REF!,4,0)))","v":""},{"$f":"IF(ISERROR(VLOOKUP(J29,#REF!,5,0)),\"\",(VLOOKUP(J29,#REF!,5,0)))","v":""},{"$f":"IF(ISERROR(VLOOKUP(J29,#REF!,6,0)),\"\",(VLOOKUP(J29,#REF!,6,0)))","v":""}]
[null,null,null,null,null,null,null,null,8,"800M-2-8",{"$f":"IF(ISERROR(VLOOKUP(J30,#REF!,2,0)),\"\",(VLOOKUP(J30,#REF!,2,0)))","v":""},{"$f":"IF(ISERROR(VLOOKUP(J30,#REF!,4,0)),\"\",(VLOOKUP(J30,#REF!,4,0)))","v":""},{"$f":"IF(ISERROR(VLOOKUP(J30,#REF!,5,0)),\"\",(VLOOKUP(J30,#REF!,5,0)))","v":""},{"$f":"IF(ISERROR(VLOOKUP(J30,#REF!,6,0)),\"\",(VLOOKUP(J30,#REF!,6,0)))","v":""}]
[null,null,null,null,null,null,null,null,"3. SERİ"]
[null,null,null,null,null,null,null,null,"Kulvar","Formül","Göğüs No","Doğum Tarihi","Adı ve Soyadı","Okulu","Elektronik Kronometre","El Kronometre","Seri Geliş"]
[null,null,null,null,null,null,null,null,1,"800M-3-1",{"$f":"IF(ISERROR(VLOOKUP(J33,#REF!,2,0)),\"\",(VLOOKUP(J33,#REF!,2,0)))","v":""},{"$f":"IF(ISERROR(VLOOKUP(J33,#REF!,4,0)),\"\",(VLOOKUP(J33,#REF!,4,0)))","v":""},{"$f":"IF(ISERROR(VLOOKUP(J33,#REF!,5,0)),\"\",(VLOOKUP(J33,#REF!,5,0)))","v":""},{"$f":"IF(ISERROR(VLOOKUP(J33,#REF!,6,0)),\"\",(VLOOKUP(J33,#REF!,6,0)))","v":""},{"$f":"IF(IF(OR(P33=\"NM\",P33=\"DNF\",P33=\"DNS\",P33=\"DQ\",P33=\"\"),P33,(ROUNDUP(P33,)+14))=0,\" \",IF(OR(P33=\"NM\",P33=\"DNF\",P33=\"DNS\",P33=\"DQ\",P33=\"\"),P33,(ROUNDUP(P33,)+14)))","v":" "}]
[null,null,null,null,null,null,null,null,2,"800M-3-2",{"$f":"IF(ISERROR(VLOOKUP(J34,#REF!,2,0)),\"\",(VLOOKUP(J34,#REF!,2,0)))","v":""},{"$f":"IF(ISERROR(VLOOKUP(J34,#REF!,4,0)),\"\",(VLOOKUP(J34,#REF!,4,0)))","v":""},{"$f":"IF(ISERROR(VLOOKUP(J34,#REF!,5,0)),\"\",(VLOOKUP(J34,#REF!,5,0)))","v":""},{"$f":"IF(ISERROR(VLOOKUP(J34,#REF!,6,0)),\"\",(VLOOKUP(J34,#REF!,6,0)))","v":""}]
[null,null,null,null,null,null,{"$f":"IF(ISTEXT(F35),\" \",IFERROR(VLOOKUP(SMALL(PUAN!$M$4:$N$110,COUNTIF(PUAN!$M$4:$N$110,\"<\"&F35)+1),PUAN!$M$4:$N$110,2,2),\"    \"))","v":"    "},null,3,"800M-3-3",{"$f":"IF(ISERROR(VLOOKUP(J35,#REF!,2,0)),\"\",(VLOOKUP(J35,#REF!,2,0)))","v":""},{"$f":"IF(ISERROR(VLOOKUP(J35,#REF!,4,0)),\"\",(VLOOKUP(J35,#REF!,4,0)))","v":""}]
[null,null,null,null,null,null,{"$f":"IF(ISTEXT(F36),\" \",IFERROR(VLOOKUP(SMALL(PUAN!$M$4:$N$110,COUNTIF(PUAN!$M$4:$N$110,\"<\"&F36)+1),PUAN!$M$4:$N$110,2,2),\"    \"))","v":"    "},null,4,"800M-3-4",{"$f":"IF(ISERROR(VLOOKUP(J36,#REF!,2,0)),\"\",(VLOOKUP(J36,#REF!,2,0)))","v":""},{"$f":"IF(ISERROR(VLOOKUP(J36,#REF!,4,0)),\"\",(VLOOKUP(J36,#REF!,4,0)))","v":""}]
[null,null,null,null,null,null,{"$f":"IF(ISTEXT(F37),\" \",IFERROR(VLOOKUP(SMALL(PUAN!$M$4:$N$110,COUNTIF(PUAN!$M$4:$N$110,\"<\"&F37)+1),PUAN!$M$4:$N$110,2,2),\"    \"))","v":"    "},null,5,"800M-3-5",{"$f":"IF(ISERROR(VLOOKUP(J37,#REF!,2,0)),\"\",(VLOOKUP(J37,#REF!,2,0)))","v":""},{"$f":"IF(ISERROR(VLOOKUP(J37,#REF!,4,0)),\"\",(VLOOKUP(J37,#REF!,4,0)))","v":""},{"$f":"IF(ISERROR(VLOOKUP(J37,#REF!,5,0)),\"\",(VLOOKUP(J37,#REF!,5,0)))","v":""},{"$f":"IF(ISERROR(VLOOKUP(J37,#REF!,6,0)),\"\",(VLOOKUP(J37,#REF!,6,0)))","v":""}]
[null,null,null,null,null,null,{"$f":"IF(ISTEXT(F38),\" \",IFERROR(VLOOKUP(SMALL(PUAN!$M$4:$N$110,COUNTIF(PUAN!$M$4:$N$110,\"<\"&F38)+1),PUAN!$M$4:$N$110,2,2),\"    \"))","v":"    "},null,6,"800M-3-6",{"$f":"IF(ISERROR(VLOOKUP(J38,#REF!,2,0)),\"\",(VLOOKUP(J38,#REF!,2,0)))","v":""},{"$f":"IF(ISERROR(VLOOKUP(J38,#REF!,4,0)),\"\",(VLOOKUP(J38,#REF!,4,0)))","v":""}]
[null,null,null,null,null,null,{"$f":"IF(ISTEXT(F39),\" \",IFERROR(VLOOKUP(SMALL(PUAN!$M$4:$N$110,COUNTIF(PUAN!$M$4:$N$110,\"<\"&F39)+1),PUAN!$M$4:$N$110,2,2),\"    \"))","v":"    "},null,7,"800M-3-7",{"$f":"IF(ISERROR(VLOOKUP(J39,#REF!,2,0)),\"\",(VLOOKUP(J39,#REF!,2,0)))","v":""},{"$f":"IF(ISERROR(VLOOKUP(J39,#REF!,4,0)),\"\",(VLOOKUP(J39,#REF!,4,0)))","v":""},{"$f":"IF(ISERROR(VLOOKUP(J39,#REF!,5,0)),\"\",(VLOOKUP(J39,#REF!,5,0)))","v":""},{"$f":"IF(ISERROR(VLOOKUP(J39,#REF!,6,0)),\"\",(VLOOKUP(J39,#REF!,6,0)))","v":""}]
[null,null,null,null,null,null,{"$f":"IF(ISTEXT(F40),\" \",IFERROR(VLOOKUP(SMALL(PUAN!$M$4:$N$110,COUNTIF(PUAN!$M$4:$N$110,\"<\"&F40)+1),PUAN!$M$4:$N$110,2,2),\"    \"))","v":"    "},null,8,"800M-3-8",{"$f":"IF(ISERROR(VLOOKUP(J40,#REF!,2,0)),\"\",(VLOOKUP(J40,#REF!,2,0)))","v":""},{"$f":"IF(ISERROR(VLOOKUP(J40,#REF!,4,0)),\"\",(VLOOKUP(J40,#REF!,4,0)))","v":""},{"$f":"IF(ISERROR(VLOOKUP(J40,#REF!,5,0)),\"\",(VLOOKUP(J40,#REF!,5,0)))","v":""},{"$f":"IF(ISERROR(VLOOKUP(J40,#REF!,6,0)),\"\",(VLOOKUP(J40,#REF!,6,0)))","v":""}]
[]
["Müsabakalar Direktörü",null,null,null,"Baş Hakem","Lider",null,"Sekreter",null,null,null,null,"Hakem","Hakem",null,"Hakem"]

{"sheet":"3000m.","index":8,"n_rows":64,"n_cols":17,"rows_kept":64,"cut":false,"hidden":false,"merged":[[5,3,6,3],[5,4,6,4],[2,13,2,16],[2,8,2,10],[5,0,6,0],[5,1,6,1],[3,0,3,2],[3,3,3,4],[3,13,3,16],[4,13,4,16],[5,6,6,6],[5,5,6,5],[5,2,6,2],[0,0,0,16],[1,0,1,16],[2,0,2,2],[2,3,2,4],[2,5,2,6]]}
[]
[{"$f":"'YARIŞMA BİLGİLERİ'!F19","v":"KOÇ TOPLULUĞU SPOR ŞENLİĞİ PUANLI ATLETİZM YARIŞLARI"}]
["Yarışma :",null,null,"3000 Metre",null,null,null,":"]
["Kategori :",null,null,{"$f":"'YARIŞMA BİLGİLERİ'!F21","v":"Kadınlar"},null,null,null,null,null,null,null,null,"Tarih-Saat ",{"$f":"'YARIŞMA PROGRAMI'!B12","v":"2017-04-15T10:45:00"}]
[null,null,null,null,null,null,null,null,null,null,null,null,null,{"$f":"NOW()","v":42842.612082291664}]
["Sıra No","Göğüs No","Doğum Tarihi\nGün/Ay/Yıl","Adı ve Soyadı","TAKIMI","Derece","Puan",null,"1. SERİ"]
[null,null,null,null,null,null,null,null,"Sıra No","Formül","Göğüs No","Doğum Tarihi","Adı ve Soyadı","TAKIMI","Elektronik Kronometre","El Kronometre","Seri Geliş"]
[1,null,null,"FADİME ÖZKAN","FORD OTOSAN",131270,11,null,1,"2000M-1-1",{"$f":"IF(ISERROR(VLOOKUP(J8,#REF!,2,0)),\"\",(VLOOKUP(J8,#REF!,2,0)))","v":""},{"$f":"IF(ISERROR(VLOOKUP(J8,#REF!,4,0)),\"\",(VLOOKUP(J8,#REF!,4,0)))","v":""},{"$f":"IF(ISERROR(VLOOKUP(J8,#REF!,5,0)),\"\",(VLOOKUP(J8,#REF!,5,0)))","v":""},{"$f":"IF(ISERROR(VLOOKUP(J8,#REF!,6,0)),\"\",(VLOOKUP(J8,#REF!,6,0)))","v":""}]
[2,null,null,"FUNDA COŞKUN","TÜPRAŞ",132626,10,null,2,"2000M-1-2",{"$f":"IF(ISERROR(VLOOKUP(J9,#REF!,2,0)),\"\",(VLOOKUP(J9,#REF!,2,0)))","v":""},72,{"$f":"IF(ISERROR(VLOOKUP(J9,#REF!,5,0)),\"\",(VLOOKUP(J9,#REF!,5,0)))","v":""},"OTOKAR",192956,null,6]
[3,null,null,"CEREN ANGILI","YAPI KREDİ",143204,9,null,2,"2000M-1-3",{"$f":"IF(ISERROR(VLOOKUP(J10,#REF!,2,0)),\"\",(VLOOKUP(J10,#REF!,2,0)))","v":""},71,"GÜNCE TOPAL","YAPI KREDİ",163959,null,4]
[4,null,null,"GÜNCE TOPAL","YAPI KREDİ",163959,"-",null,3,null,null,70,"CEREN ANGILI","YAPI KREDİ",143204,null,3]
[5,null,null,"BERİL BAŞLIGİL","ARÇELİK",182902,8,null,3,"2000M-1-4",{"$f":"IF(ISERROR(VLOOKUP(J12,#REF!,2,0)),\"\",(VLOOKUP(J12,#REF!,2,0)))","v":""},69,"FADİME ÖZKAN","FORD OTOSAN",131270,null,1]
[6,null,null,{"$f":"IF(ISERROR(VLOOKUP(A13,#REF!,5,0)),\"\",(VLOOKUP(A13,#REF!,5,0)))","v":""},"OTOKAR",192956,7,null,4,"2000M-1-5",{"$f":"IF(ISERROR(VLOOKUP(J13,#REF!,2,0)),\"\",(VLOOKUP(J13,#REF!,2,0)))","v":""},68,"BERİL BAŞLIGİL","ARÇELİK",182902,null,5]
[7,null,null,"HÜLYA ÇALIKOĞLU","ZER",193434,6,null,4,"2000M-1-7",{"$f":"IF(ISERROR(VLOOKUP(J14,#REF!,2,0)),\"\",(VLOOKUP(J14,#REF!,2,0)))","v":""},67,"NİDA MERAL","KOÇ SİSTEM","DNS",null,"-"]
[8,null,null,"MELİKE ERBAŞI","ZER",211000,"-",null,5,"2000M-1-8",{"$f":"IF(ISERROR(VLOOKUP(J15,#REF!,2,0)),\"\",(VLOOKUP(J15,#REF!,2,0)))","v":""},66,"ŞULE EREN","VKV SAĞLIK KURULUŞLARI","DNS",null,"-"]
[9,null,null,"DENİZ ILGINER","ZER",214254,"-",null,5,null,null,65,"FUNDA COŞKUN","TÜPRAŞ",132626,null,2]
["-",null,null,"NİDA MERAL","KOÇ SİSTEM","DNS","-",null,6,null,null,63,"AYFER ÇEKÇİ","ZER","DNS",null,"-"]
["-",null,null,"ŞULE EREN","VKV SAĞLIK KURULUŞLARI","DNS","-",null,7,"2000M-1-10",{"$f":"IF(ISERROR(VLOOKUP(J18,#REF!,2,0)),\"\",(VLOOKUP(J18,#REF!,2,0)))","v":""},62,"DENİZ ILGINER","ZER",214254,null,9]
["-",null,null,"AYFER ÇEKÇİ","ZER","DNS","-",null,7,"2000M-1-11",{"$f":"IF(ISERROR(VLOOKUP(J19,#REF!,2,0)),\"\",(VLOOKUP(J19,#REF!,2,0)))","v":""},61,"HÜLYA ÇALIKOĞLU","ZER",193434,null,7]
["-",null,null,"ARZU ASLAN KESİMER","TAT GIDA ","DNS","-",null,8,"2000M-1-12",{"$f":"IF(ISERROR(VLOOKUP(J20,#REF!,2,0)),\"\",(VLOOKUP(J20,#REF!,2,0)))","v":""},60,"MELİKE ERBAŞI","ZER",211000,null,8]
[null,null,null,null,null,null,null,null,8,"2000M-1-13",{"$f":"IF(ISERROR(VLOOKUP(J21,#REF!,2,0)),\"\",(VLOOKUP(J21,#REF!,2,0)))","v":""},59,"ARZU ASLAN KESİMER","TAT GIDA ","DNS",null,"-"]
[]
[null,null,null,null,null,null,null,null,"2. SERİ"]
[null,null,null,null,null,null,null,null,"Sıra No","Formül","Göğüs No","Doğum Tarihi","Adı ve Soyadı","Okulu","Elektronik Kronometre","El Kronometre","Seri Geliş"]
[null,null,null,null,null,null,null,null,1,"2000M-2-1",{"$f":"IF(ISERROR(VLOOKUP(J25,#REF!,2,0)),\"\",(VLOOKUP(J25,#REF!,2,0)))","v":""},{"$f":"IF(ISERROR(VLOOKUP(J25,#REF!,4,0)),\"\",(VLOOKUP(J25,#REF!,4,0)))","v":""},{"$f":"IF(ISERROR(VLOOKUP(J25,#REF!,5,0)),\"\",(VLOOKUP(J25,#REF!,5,0)))","v":""},{"$f":"IF(ISERROR(VLOOKUP(J25,#REF!,6,0)),\"\",(VLOOKUP(J25,#REF!,6,0)))","v":""}]
[null,null,null,null,null,null,null,null,2,"2000M-2-2",{"$f":"IF(ISERROR(VLOOKUP(J26,#REF!,2,0)),\"\",(VLOOKUP(J26,#REF!,2,0)))","v":""},{"$f":"IF(ISERROR(VLOOKUP(J26,#REF!,4,0)),\"\",(VLOOKUP(J26,#REF!,4,0)))","v":""},{"$f":"IF(ISERROR(VLOOKUP(J26,#REF!,5,0)),\"\",(VLOOKUP(J26,#REF!,5,0)))","v":""},{"$f":"IF(ISERROR(VLOOKUP(J26,#REF!,6,0)),\"\",(VLOOKUP(J26,#REF!,6,0)))","v":""}]
[null,null,null,null,null,null,null,null,3,"2000M-2-3",{"$f":"IF(ISERROR(VLOOKUP(J27,#REF!,2,0)),\"\",(VLOOKUP(J27,#REF!,2,0)))","v":""},{"$f":"IF(ISERROR(VLOOKUP(J27,#REF!,4,0)),\"\",(VLOOKUP(J27,#REF!,4,0)))","v":""},{"$f":"IF(ISERROR(VLOOKUP(J27,#REF!,5,0)),\"\",(VLOOKUP(J27,#REF!,5,0)))","v":""},{"$f":"IF(ISERROR(VLOOKUP(J27,#REF!,6,0)),\"\",(VLOOKUP(J27,#REF!,6,0)))","v":""}]
[null,null,null,null,null,null,null,null,4,"2000M-2-4",{"$f":"IF(ISERROR(VLOOKUP(J28,#REF!,2,0)),\"\",(VLOOKUP(J28,#REF!,2,0)))","v":""},{"$f":"IF(ISERROR(VLOOKUP(J28,#REF!,4,0)),\"\",(VLOOKUP(J28,#REF!,4,0)))","v":""},{"$f":"IF(ISERROR(VLOOKUP(J28,#REF!,5,0)),\"\",(VLOOKUP(J28,#REF!,5,0)))","v":""},{"$f":"IF(ISERROR(VLOOKUP(J28,#REF!,6,0)),\"\",(VLOOKUP(J28,#REF!,6,0)))","v":""}]
[null,null,null,null,null,null,null,null,5,"2000M-2-5",{"$f":"IF(ISERROR(VLOOKUP(J29,#REF!,2,0)),\"\",(VLOOKUP(J29,#REF!,2,0)))","v":""},{"$f":"IF(ISERROR(VLOOKUP(J29,#REF!,4,0)),\"\",(VLOOKUP(J29,#REF!,4,0)))","v":""},{"$f":"IF(ISERROR(VLOOKUP(J29,#REF!,5,0)),\"\",(VLOOKUP(J29,#REF!,5,0)))","v":""},{"$f":"IF(ISERROR(VLOOKUP(J29,#REF!,6,0)),\"\",(VLOOKUP(J29,#REF!,6,0)))","v":""}]
[null,null,null,null,null,null,null,null,6,"2000M-2-6",{"$f":"IF(ISERROR(VLOOKUP(J30,#REF!,2,0)),\"\",(VLOOKUP(J30,#REF!,2,0)))","v":""},{"$f":"IF(ISERROR(VLOOKUP(J30,#REF!,4,0)),\"\",(VLOOKUP(J30,#REF!,4,0)))","v":""},{"$f":"IF(ISERROR(VLOOKUP(J30,#REF!,5,0)),\"\",(VLOOKUP(J30,#REF!,5,0)))","v":""},{"$f":"IF(ISERROR(VLOOKUP(J30,#REF!,6,0)),\"\",(VLOOKUP(J30,#REF!,6,0)))","v":""}]
[null,null,null,null,null,null,null,null,7,"2000M-2-7",{"$f":"IF(ISERROR(VLOOKUP(J31,#REF!,2,0)),\"\",(VLOOKUP(J31,#REF!,2,0)))","v":""},{"$f":"IF(ISERROR(VLOOKUP(J31,#REF!,4,0)),\"\",(VLOOKUP(J31,#REF!,4,0)))","v":""},{"$f":"IF(ISERROR(VLOOKUP(J31,#REF!,5,0)),\"\",(VLOOKUP(J31,#REF!,5,0)))","v":""},{"$f":"IF(ISERROR(VLOOKUP(J31,#REF!,6,0)),\"\",(VLOOKUP(J31,#REF!,6,0)))","v":""}]
[null,null,null,null,null,null,null,null,8,"2000M-2-8",{"$f":"IF(ISERROR(VLOOKUP(J32,#REF!,2,0)),\"\",(VLOOKUP(J32,#REF!,2,0)))","v":""},{"$f":"IF(ISERROR(VLOOKUP(J32,#REF!,4,0)),\"\",(VLOOKUP(J32,#REF!,4,0)))","v":""},{"$f":"IF(ISERROR(VLOOKUP(J32,#REF!,5,0)),\"\",(VLOOKUP(J32,#REF!,5,0)))","v":""},{"$f":"IF(ISERROR(VLOOKUP(J32,#REF!,6,0)),\"\",(VLOOKUP(J32,#REF!,6,0)))","v":""}]
[null,null,null,null,null,null,null,null,9,"2000M-2-9",{"$f":"IF(ISERROR(VLOOKUP(J33,#REF!,2,0)),\"\",(VLOOKUP(J33,#REF!,2,0)))","v":""},{"$f":"IF(ISERROR(VLOOKUP(J33,#REF!,4,0)),\"\",(VLOOKUP(J33,#REF!,4,0)))","v":""},{"$f":"IF(ISERROR(VLOOKUP(J33,#REF!,5,0)),\"\",(VLOOKUP(J33,#REF!,5,0)))","v":""},{"$f":"IF(ISERROR(VLOOKUP(J33,#REF!,6,0)),\"\",(VLOOKUP(J33,#REF!,6,0)))","v":""}]
[null,null,null,null,null,null,null,null,10,"2000M-2-10",{"$f":"IF(ISERROR(VLOOKUP(J34,#REF!,2,0)),\"\",(VLOOKUP(J34,#REF!,2,0)))","v":""},{"$f":"IF(ISERROR(VLOOKUP(J34,#REF!,4,0)),\"\",(VLOOKUP(J34,#REF!,4,0)))","v":""},{"$f":"IF(ISERROR(VLOOKUP(J34,#REF!,5,0)),\"\",(VLOOKUP(J34,#REF!,5,0)))","v":""},{"$f":"IF(ISERROR(VLOOKUP(J34,#REF!,6,0)),\"\",(VLOOKUP(J34,#REF!,6,0)))","v":""},{"$f":"IF(IF(OR(P34=\"NM\",P34=\"DNF\",P34=\"DNS\",P34=\"DQ\",P34=\"\"),P34,(ROUNDUP(P34,)+14))=0,\" \",IF(OR(P34=\"NM\",P34=\"DNF\",P34=\"DNS\",P34=\"DQ\",P34=\"\"),P34,(ROUNDUP(P34,)+14)))","v":" "}]
[null,null,null,null,null,null,null,null,"3. SERİ"]
[null,null,null,null,null,null,null,null,"Sıra No","Formül","Göğüs No","Doğum Tarihi","Adı ve Soyadı","Okulu","Elektronik Kronometre","El Kronometre","Seri Geliş"]
[null,null,null,null,null,null,null,null,1,"2000M-3-1",{"$f":"IF(ISERROR(VLOOKUP(J37,#REF!,2,0)),\"\",(VLOOKUP(J37,#REF!,2,0)))","v":""},{"$f":"IF(ISERROR(VLOOKUP(J37,#REF!,4,0)),\"\",(VLOOKUP(J37,#REF!,4,0)))","v":""},{"$f":"IF(ISERROR(VLOOKUP(J37,#REF!,5,0)),\"\",(VLOOKUP(J37,#REF!,5,0)))","v":""},{"$f":"IF(ISERROR(VLOOKUP(J37,#REF!,6,0)),\"\",(VLOOKUP(J37,#REF!,6,0)))","v":""}]
[null,null,null,null,null,null,null,null,2,"2000M-3-2",{"$f":"IF(ISERROR(VLOOKUP(J38,#REF!,2,0)),\"\",(VLOOKUP(J38,#REF!,2,0)))","v":""},{"$f":"IF(ISERROR(VLOOKUP(J38,#REF!,4,0)),\"\",(VLOOKUP(J38,#REF!,4,0)))","v":""},{"$f":"IF(ISERROR(VLOOKUP(J38,#REF!,5,0)),\"\",(VLOOKUP(J38,#REF!,5,0)))","v":""},{"$f":"IF(ISERROR(VLOOKUP(J38,#REF!,6,0)),\"\",(VLOOKUP(J38,#REF!,6,0)))","v":""}]
[null,null,null,null,null,null,null,null,3,"2000M-3-3",{"$f":"IF(ISERROR(VLOOKUP(J39,#REF!,2,0)),\"\",(VLOOKUP(J39,#REF!,2,0)))","v":""},{"$f":"IF(ISERROR(VLOOKUP(J39,#REF!,4,0)),\"\",(VLOOKUP(J39,#REF!,4,0)))","v":""},{"$f":"IF(ISERROR(VLOOKUP(J39,#REF!,5,0)),\"\",(VLOOKUP(J39,#REF!,5,0)))","v":""},{"$f":"IF(ISERROR(VLOOKUP(J39,#REF!,6,0)),\"\",(VLOOKUP(J39,#REF!,6,0)))","v":""}]
[null,null,null,null,null,null,{"$f":"IF(ISTEXT(F40),\" \",IFERROR(VLOOKUP(SMALL(PUAN!$Q$4:$R$111,COUNTIF(PUAN!$Q$4:$R$111,\"<\"&F40)+1),PUAN!$Q$4:$R$111,2,2),\"    \"))","v":"    "},null,4,"2000M-3-4",{"$f":"IF(ISERROR(VLOOKUP(J40,#REF!,2,0)),\"\",(VLOOKUP(J40,#REF!,2,0)))","v":""},{"$f":"IF(ISERROR(VLOOKUP(J40,#REF!,4,0)),\"\",(VLOOKUP(J40,#REF!,4,0)))","v":""},{"$f":"IF(ISERROR(VLOOKUP(J40,#REF!,5,0)),\"\",(VLOOKUP(J40,#REF!,5,0)))","v":""},{"$f":"IF(ISERROR(VLOOKUP(J40,#REF!,6,0)),\"\",(VLOOKUP(J40,#REF!,6,0)))","v":""}]
[null,null,null,null,null,null,{"$f":"IF(ISTEXT(F41),\" \",IFERROR(VLOOKUP(SMALL(PUAN!$Q$4:$R$111,COUNTIF(PUAN!$Q$4:$R$111,\"<\"&F41)+1),PUAN!$Q$4:$R$111,2,2),\"    \"))","v":"    "},null,5,"2000M-3-5",{"$f":"IF(ISERROR(VLOOKUP(J41,#REF!,2,0)),\"\",(VLOOKUP(J41,#REF!,2,0)))","v":""},{"$f":"IF(ISERROR(VLOOKUP(J41,#REF!,4,0)),\"\",(VLOOKUP(J41,#REF!,4,0)))","v":""},{"$f":"IF(ISERROR(VLOOKUP(J41,#REF!,5,0)),\"\",(VLOOKUP(J41,#REF!,5,0)))","v":""},{"$f":"IF(ISERROR(VLOOKUP(J41,#REF!,6,0)),\"\",(VLOOKUP(J41,#REF!,6,0)))","v":""}]
[null,null,null,null,null,null,{"$f":"IF(ISTEXT(F42),\" \",IFERROR(VLOOKUP(SMALL(PUAN!$Q$4:$R$111,COUNTIF(PUAN!$Q$4:$R$111,\"<\"&F42)+1),PUAN!$Q$4:$R$111,2,2),\"    \"))","v":"    "},null,6,"2000M-3-6",{"$f":"IF(ISERROR(VLOOKUP(J42,#REF!,2,0)),\"\",(VLOOKUP(J42,#REF!,2,0)))","v":""},{"$f":"IF(ISERROR(VLOOKUP(J42,#REF!,4,0)),\"\",(VLOOKUP(J42,#REF!,4,0)))","v":""},{"$f":"IF(ISERROR(VLOOKUP(J42,#REF!,5,0)),\"\",(VLOOKUP(J42,#REF!,5,0)))","v":""},{"$f":"IF(ISERROR(VLOOKUP(J42,#REF!,6,0)),\"\",(VLOOKUP(J42,#REF!,6,0)))","v":""}]
[null,null,null,null,null,null,{"$f":"IF(ISTEXT(F43),\" \",IFERROR(VLOOKUP(SMALL(PUAN!$Q$4:$R$111,COUNTIF(PUAN!$Q$4:$R$111,\"<\"&F43)+1),PUAN!$Q$4:$R$111,2,2),\"    \"))","v":"    "},null,7,"2000M-3-7",{"$f":"IF(ISERROR(VLOOKUP(J43,#REF!,2,0)),\"\",(VLOOKUP(J43,#REF!,2,0)))","v":""},{"$f":"IF(ISERROR(VLOOKUP(J43,#REF!,4,0)),\"\",(VLOOKUP(J43,#REF!,4,0)))","v":""},{"$f":"IF(ISERROR(VLOOKUP(J43,#REF!,5,0)),\"\",(VLOOKUP(J43,#REF!,5,0)))","v":""},{"$f":"IF(ISERROR(VLOOKUP(J43,#REF!,6,0)),\"\",(VLOOKUP(J43,#REF!,6,0)))","v":""}]
[null,null,null,null,null,null,{"$f":"IF(ISTEXT(F44),\" \",IFERROR(VLOOKUP(SMALL(PUAN!$Q$4:$R$111,COUNTIF(PUAN!$Q$4:$R$111,\"<\"&F44)+1),PUAN!$Q$4:$R$111,2,2),\"    \"))","v":"    "},null,8,"2000M-3-8",{"$f":"IF(ISERROR(VLOOKUP(J44,#REF!,2,0)),\"\",(VLOOKUP(J44,#REF!,2,0)))","v":""},{"$f":"IF(ISERROR(VLOOKUP(J44,#REF!,4,0)),\"\",(VLOOKUP(J44,#REF!,4,0)))","v":""},{"$f":"IF(ISERROR(VLOOKUP(J44,#REF!,5,0)),\"\",(VLOOKUP(J44,#REF!,5,0)))","v":""},{"$f":"IF(ISERROR(VLOOKUP(J44,#REF!,6,0)),\"\",(VLOOKUP(J44,#REF!,6,0)))","v":""}]
[null,null,null,null,null,null,{"$f":"IF(ISTEXT(F45),\" \",IFERROR(VLOOKUP(SMALL(PUAN!$Q$4:$R$111,COUNTIF(PUAN!$Q$4:$R$111,\"<\"&F45)+1),PUAN!$Q$4:$R$111,2,2),\"    \"))","v":"    "},null,9,"2000M-3-9",{"$f":"IF(ISERROR(VLOOKUP(J45,#REF!,2,0)),\"\",(VLOOKUP(J45,#REF!,2,0)))","v":""},{"$f":"IF(ISERROR(VLOOKUP(J45,#REF!,4,0)),\"\",(VLOOKUP(J45,#REF!,4,0)))","v":""},{"$f":"IF(ISERROR(VLOOKUP(J45,#REF!,5,0)),\"\",(VLOOKUP(J45,#REF!,5,0)))","v":""},{"$f":"IF(ISERROR(VLOOKUP(J45,#REF!,6,0)),\"\",(VLOOKUP(J45,#REF!,6,0)))","v":""}]
[null,null,null,null,null,null,{"$f":"IF(ISTEXT(F46),\" \",IFERROR(VLOOKUP(SMALL(PUAN!$Q$4:$R$111,COUNTIF(PUAN!$Q$4:$R$111,\"<\"&F46)+1),PUAN!$Q$4:$R$111,2,2),\"    \"))","v":"    "},null,10,"2000M-3-10",{"$f":"IF(ISERROR(VLOOKUP(J46,#REF!,2,0)),\"\",(VLOOKUP(J46,#REF!,2,0)))","v":""},{"$f":"IF(ISERROR(VLOOKUP(J46,#REF!,4,0)),\"\",(VLOOKUP(J46,#REF!,4,0)))","v":""},{"$f":"IF(ISERROR(VLOOKUP(J46,#REF!,5,0)),\"\",(VLOOKUP(J46,#REF!,5,0)))","v":""},{"$f":"IF(ISERROR(VLOOKUP(J46,#REF!,6,0)),\"\",(VLOOKUP(J46,#REF!,6,0)))","v":""}]
[null,null,null,null,null,null,{"$f":"IF(ISTEXT(F47),\" \",IFERROR(VLOOKUP(SMALL(PUAN!$Q$4:$R$111,COUNTIF(PUAN!$Q$4:$R$111,\"<\"&F47)+1),PUAN!$Q$4:$R$111,2,2),\"    \"))","v":"    "},null,11,"2000M-3-11",{"$f":"IF(ISERROR(VLOOKUP(J47,#REF!,2,0)),\"\",(VLOOKUP(J47,#REF!,2,0)))","v":""},{"$f":"IF(ISERROR(VLOOKUP(J47,#REF!,4,0)),\"\",(VLOOKUP(J47,#REF!,4,0)))","v":""},{"$f":"IF(ISERROR(VLOOKUP(J47,#REF!,5,0)),\"\",(VLOOKUP(J47,#REF!,5,0)))","v":""},{"$f":"IF(ISERROR(VLOOKUP(J47,#REF!,6,0)),\"\",(VLOOKUP(J47,#REF!,6,0)))","v":""}]
[null,null,null,null,null,null,{"$f":"IF(ISTEXT(F48),\" \",IFERROR(VLOOKUP(SMALL(PUAN!$Q$4:$R$111,COUNTIF(PUAN!$Q$4:$R$111,\"<\"&F48)+1),PUAN!$Q$4:$R$111,2,2),\"    \"))","v":"    "},null,12,"2000M-3-12",{"$f":"IF(ISERROR(VLOOKUP(J48,#REF!,2,0)),\"\",(VLOOKUP(J48,#REF!,2,0)))","v":""},{"$f":"IF(ISERROR(VLOOKUP(J48,#REF!,4,0)),\"\",(VLOOKUP(J48,#REF!,4,0)))","v":""},{"$f":"IF(ISERROR(VLOOKUP(J48,#REF!,5,0)),\"\",(VLOOKUP(J48,#REF!,5,0)))","v":""},{"$f":"IF(ISERROR(VLOOKUP(J48,#REF!,6,0)),\"\",(VLOOKUP(J48,#REF!,6,0)))","v":""}]
[41,null,null,null,null,null,{"$f":"IF(ISTEXT(F49),\" \",IFERROR(VLOOKUP(SMALL(PUAN!$Q$4:$R$111,COUNTIF(PUAN!$Q$4:$R$111,\"<\"&F49)+1),PUAN!$Q$4:$R$111,2,2),\"    \"))","v":"    "},null,"4. SERİ"]
[42,null,null,null,null,null,{"$f":"IF(ISTEXT(F50),\" \",IFERROR(VLOOKUP(SMALL(PUAN!$Q$4:$R$111,COUNTIF(PUAN!$Q$4:$R$111,\"<\"&F50)+1),PUAN!$Q$4:$R$111,2,2),\"    \"))","v":"    "},null,"Sıra No","Formül","Göğüs No","Doğum Tarihi","Adı ve Soyadı","Okulu"]
[43,null,null,null,null,null,{"$f":"IF(ISTEXT(F51),\" \",IFERROR(VLOOKUP(SMALL(PUAN!$Q$4:$R$111,COUNTIF(PUAN!$Q$4:$R$111,\"<\"&F51)+1),PUAN!$Q$4:$R$111,2,2),\"    \"))","v":"    "},null,1,"2000M-4-1",{"$f":"IF(ISERROR(VLOOKUP(J51,#REF!,2,0)),\"\",(VLOOKUP(J51,#REF!,2,0)))","v":""},{"$f":"IF(ISERROR(VLOOKUP(J51,#REF!,4,0)),\"\",(VLOOKUP(J51,#REF!,4,0)))","v":""},{"$f":"IF(ISERROR(VLOOKUP(J51,#REF!,5,0)),\"\",(VLOOKUP(J51,#REF!,5,0)))","v":""},{"$f":"IF(ISERROR(VLOOKUP(J51,#REF!,6,0)),\"\",(VLOOKUP(J51,#REF!,6,0)))","v":""}]
[44,null,null,null,null,null,{"$f":"IF(ISTEXT(F52),\" \",IFERROR(VLOOKUP(SMALL(PUAN!$Q$4:$R$111,COUNTIF(PUAN!$Q$4:$R$111,\"<\"&F52)+1),PUAN!$Q$4:$R$111,2,2),\"    \"))","v":"    "},null,2,"2000M-4-2",{"$f":"IF(ISERROR(VLOOKUP(J52,#REF!,2,0)),\"\",(VLOOKUP(J52,#REF!,2,0)))","v":""},{"$f":"IF(ISERROR(VLOOKUP(J52,#REF!,4,0)),\"\",(VLOOKUP(J52,#REF!,4,0)))","v":""},{"$f":"IF(ISERROR(VLOOKUP(J52,#REF!,5,0)),\"\",(VLOOKUP(J52,#REF!,5,0)))","v":""},{"$f":"IF(ISERROR(VLOOKUP(J52,#REF!,6,0)),\"\",(VLOOKUP(J52,#REF!,6,0)))","v":""}]
[45,null,null,null,null,null,{"$f":"IF(ISTEXT(F53),\" \",IFERROR(VLOOKUP(SMALL(PUAN!$Q$4:$R$111,COUNTIF(PUAN!$Q$4:$R$111,\"<\"&F53)+1),PUAN!$Q$4:$R$111,2,2),\"    \"))","v":"    "},null,3,"2000M-4-3",{"$f":"IF(ISERROR(VLOOKUP(J53,#REF!,2,0)),\"\",(VLOOKUP(J53,#REF!,2,0)))","v":""},{"$f":"IF(ISERROR(VLOOKUP(J53,#REF!,4,0)),\"\",(VLOOKUP(J53,#REF!,4,0)))","v":""},{"$f":"IF(ISERROR(VLOOKUP(J53,#REF!,5,0)),\"\",(VLOOKUP(J53,#REF!,5,0)))","v":""},{"$f":"IF(ISERROR(VLOOKUP(J53,#REF!,6,0)),\"\",(VLOOKUP(J53,#REF!,6,0)))","v":""}]
[46,null,null,null,null,null,{"$f":"IF(ISTEXT(F54),\" \",IFERROR(VLOOKUP(SMALL(PUAN!$Q$4:$R$111,COUNTIF(PUAN!$Q$4:$R$111,\"<\"&F54)+1),PUAN!$Q$4:$R$111,2,2),\"    \"))","v":"    "},null,4,"2000M-4-4",{"$f":"IF(ISERROR(VLOOKUP(J54,#REF!,2,0)),\"\",(VLOOKUP(J54,#REF!,2,0)))","v":""},{"$f":"IF(ISERROR(VLOOKUP(J54,#REF!,4,0)),\"\",(VLOOKUP(J54,#REF!,4,0)))","v":""},{"$f":"IF(ISERROR(VLOOKUP(J54,#REF!,5,0)),\"\",(VLOOKUP(J54,#REF!,5,0)))","v":""},{"$f":"IF(ISERROR(VLOOKUP(J54,#REF!,6,0)),\"\",(VLOOKUP(J54,#REF!,6,0)))","v":""}]
[47,null,null,null,null,null,{"$f":"IF(ISTEXT(F55),\" \",IFERROR(VLOOKUP(SMALL(PUAN!$Q$4:$R$111,COUNTIF(PUAN!$Q$4:$R$111,\"<\"&F55)+1),PUAN!$Q$4:$R$111,2,2),\"    \"))","v":"    "},null,5,"2000M-4-5",{"$f":"IF(ISERROR(VLOOKUP(J55,#REF!,2,0)),\"\",(VLOOKUP(J55,#REF!,2,0)))","v":""},{"$f":"IF(ISERROR(VLOOKUP(J55,#REF!,4,0)),\"\",(VLOOKUP(J55,#REF!,4,0)))","v":""},{"$f":"IF(ISERROR(VLOOKUP(J55,#REF!,5,0)),\"\",(VLOOKUP(J55,#REF!,5,0)))","v":""},{"$f":"IF(ISERROR(VLOOKUP(J55,#REF!,6,0)),\"\",(VLOOKUP(J55,#REF!,6,0)))","v":""}]
[48,null,null,null,null,null,{"$f":"IF(ISTEXT(F56),\" \",IFERROR(VLOOKUP(SMALL(PUAN!$Q$4:$R$111,COUNTIF(PUAN!$Q$4:$R$111,\"<\"&F56)+1),PUAN!$Q$4:$R$111,2,2),\"    \"))","v":"    "},null,6,"2000M-4-6",{"$f":"IF(ISERROR(VLOOKUP(J56,#REF!,2,0)),\"\",(VLOOKUP(J56,#REF!,2,0)))","v":""},{"$f":"IF(ISERROR(VLOOKUP(J56,#REF!,4,0)),\"\",(VLOOKUP(J56,#REF!,4,0)))","v":""},{"$f":"IF(ISERROR(VLOOKUP(J56,#REF!,5,0)),\"\",(VLOOKUP(J56,#REF!,5,0)))","v":""},{"$f":"IF(ISERROR(VLOOKUP(J56,#REF!,6,0)),\"\",(VLOOKUP(J56,#REF!,6,0)))","v":""}]
[49,null,null,null,null,null,{"$f":"IF(ISTEXT(F57),\" \",IFERROR(VLOOKUP(SMALL(PUAN!$Q$4:$R$111,COUNTIF(PUAN!$Q$4:$R$111,\"<\"&F57)+1),PUAN!$Q$4:$R$111,2,2),\"    \"))","v":"    "},null,7,"2000M-4-7",{"$f":"IF(ISERROR(VLOOKUP(J57,#REF!,2,0)),\"\",(VLOOKUP(J57,#REF!,2,0)))","v":""},{"$f":"IF(ISERROR(VLOOKUP(J57,#REF!,4,0)),\"\",(VLOOKUP(J57,#REF!,4,0)))","v":""},{"$f":"IF(ISERROR(VLOOKUP(J57,#REF!,5,0)),\"\",(VLOOKUP(J57,#REF!,5,0)))","v":""},{"$f":"IF(ISERROR(VLOOKUP(J57,#REF!,6,0)),\"\",(VLOOKUP(J57,#REF!,6,0)))","v":""}]
[50,null,null,null,null,null,{"$f":"IF(ISTEXT(F58),\" \",IFERROR(VLOOKUP(SMALL(PUAN!$Q$4:$R$111,COUNTIF(PUAN!$Q$4:$R$111,\"<\"&F58)+1),PUAN!$Q$4:$R$111,2,2),\"    \"))","v":"    "},null,8,"2000M-4-8",{"$f":"IF(ISERROR(VLOOKUP(J58,#REF!,2,0)),\"\",(VLOOKUP(J58,#REF!,2,0)))","v":""},{"$f":"IF(ISERROR(VLOOKUP(J58,#REF!,4,0)),\"\",(VLOOKUP(J58,#REF!,4,0)))","v":""},{"$f":"IF(ISERROR(VLOOKUP(J58,#REF!,5,0)),\"\",(VLOOKUP(J58,#REF!,5,0)))","v":""},{"$f":"IF(ISERROR(VLOOKUP(J58,#REF!,6,0)),\"\",(VLOOKUP(J58,#REF!,6,0)))","v":""}]
[51,null,null,null,null,null,{"$f":"IF(ISTEXT(F59),\" \",IFERROR(VLOOKUP(SMALL(PUAN!$Q$4:$R$111,COUNTIF(PUAN!$Q$4:$R$111,\"<\"&F59)+1),PUAN!$Q$4:$R$111,2,2),\"    \"))","v":"    "},null,9,"2000M-4-9",{"$f":"IF(ISERROR(VLOOKUP(J59,#REF!,2,0)),\"\",(VLOOKUP(J59,#REF!,2,0)))","v":""},{"$f":"IF(ISERROR(VLOOKUP(J59,#REF!,4,0)),\"\",(VLOOKUP(J59,#REF!,4,0)))","v":""},{"$f":"IF(ISERROR(VLOOKUP(J59,#REF!,5,0)),\"\",(VLOOKUP(J59,#REF!,5,0)))","v":""},{"$f":"IF(ISERROR(VLOOKUP(J59,#REF!,6,0)),\"\",(VLOOKUP(J59,#REF!,6,0)))","v":""}]
[52,null,null,null,null,null,{"$f":"IF(ISTEXT(F60),\" \",IFERROR(VLOOKUP(SMALL(PUAN!$Q$4:$R$111,COUNTIF(PUAN!$Q$4:$R$111,\"<\"&F60)+1),PUAN!$Q$4:$R$111,2,2),\"    \"))","v":"    "},null,10,"2000M-4-10",{"$f":"IF(ISERROR(VLOOKUP(J60,#REF!,2,0)),\"\",(VLOOKUP(J60,#REF!,2,0)))","v":""},{"$f":"IF(ISERROR(VLOOKUP(J60,#REF!,4,0)),\"\",(VLOOKUP(J60,#REF!,4,0)))","v":""},{"$f":"IF(ISERROR(VLOOKUP(J60,#REF!,5,0)),\"\",(VLOOKUP(J60,#REF!,5,0)))","v":""},{"$f":"IF(ISERROR(VLOOKUP(J60,#REF!,6,0)),\"\",(VLOOKUP(J60,#REF!,6,0)))","v":""}]
[53,null,null,null,null,null,{"$f":"IF(ISTEXT(F61),\" \",IFERROR(VLOOKUP(SMALL(PUAN!$Q$4:$R$111,COUNTIF(PUAN!$Q$4:$R$111,\"<\"&F61)+1),PUAN!$Q$4:$R$111,2,2),\"    \"))","v":"    "},null,11,"2000M-4-11",{"$f":"IF(ISERROR(VLOOKUP(J61,#REF!,2,0)),\"\",(VLOOKUP(J61,#REF!,2,0)))","v":""},{"$f":"IF(ISERROR(VLOOKUP(J61,#REF!,4,0)),\"\",(VLOOKUP(J61,#REF!,4,0)))","v":""},{"$f":"IF(ISERROR(VLOOKUP(J61,#REF!,5,0)),\"\",(VLOOKUP(J61,#REF!,5,0)))","v":""},{"$f":"IF(ISERROR(VLOOKUP(J61,#REF!,6,0)),\"\",(VLOOKUP(J61,#REF!,6,0)))","v":""}]
[54,null,null,null,null,null,{"$f":"IF(ISTEXT(F62),\" \",IFERROR(VLOOKUP(SMALL(PUAN!$Q$4:$R$111,COUNTIF(PUAN!$Q$4:$R$111,\"<\"&F62)+1),PUAN!$Q$4:$R$111,2,2),\"    \"))","v":"    "},null,12,"2000M-4-12",{"$f":"IF(ISERROR(VLOOKUP(J62,#REF!,2,0)),\"\",(VLOOKUP(J62,#REF!,2,0)))","v":""},{"$f":"IF(ISERROR(VLOOKUP(J62,#REF!,4,0)),\"\",(VLOOKUP(J62,#REF!,4,0)))","v":""},{"$f":"IF(ISERROR(VLOOKUP(J62,#REF!,5,0)),\"\",(VLOOKUP(J62,#REF!,5,0)))","v":""},{"$f":"IF(ISERROR(VLOOKUP(J62,#REF!,6,0)),\"\",(VLOOKUP(J62,#REF!,6,0)))","v":""}]
[]
["Müsabakalar Direktörü",null,null,null,"Baş Hakem","Lider",null,"Sekreter",null,null,null,null,"Hakem","Hakem",null,"Hakem"]

{"sheet":"Yüksek","index":9,"n_rows":34,"n_cols":35,"rows_kept":34,"cut":false,"hidden":false,"merged":[[5,32,6,32],[5,1,6,1],[2,14,2,15],[5,3,6,3],[5,4,6,4],[5,5,6,5],[3,4,3,5],[4,32,4,34],[5,33,6,33],[5,34,6,34],[5,6,5,31],[3,0,3,3],[5,0,6,0],[3,32,3,34],[5,2,6,2],[0,0,0,34],[1,0,1,34],[2,0,2,3],[2,4,2,5],[2,20,2,23],[2,32,2,34]]}
[]
[{"$f":"'YARIŞMA BİLGİLERİ'!F19","v":"KOÇ TOPLULUĞU SPOR ŞENLİĞİ PUANLI ATLETİZM YARIŞLARI"}]
["Yarışma :",null,null,null,{"$f":"'YARIŞMA PROGRAMI'!C10","v":"Yüksek  Atlama"}]
["Kategori : ",null,null,null,{"$f":"'YARIŞMA BİLGİLERİ'!F21","v":"Kadınlar"},null,null,null,null,null,null,null,null,null,null,null,null,null,null,null,null,null,null,null,null,null,null,null,null,null,null,null,{"$f":"'YARIŞMA PROGRAMI'!B10","v":"15 Nisan 2017 - 10:15"}]
[null,null,null,null,null,null,null,null,null,null,null,null,null,null,null,null,null,null,null,null,null,null,null,null,null,null,null,null,null,null,null,null,{"$f":"NOW()","v":42842.612082291664}]
["SIRA NO",null,"GÖĞÜS NO","DOĞUM TARİHİ","ADI VE SOYADI","OKULU","A  T  L  A  M  A  L  A  R",null,null,null,null,null,null,null,null,null,null,null,null,null,null,null,null,null,null,null,null,null,null,null,null,null,"SONUÇ","PUAN","KLASMAN"]
[null,null,null,null,null,null,90,95,100,105,110,115,118,121,124,127,130,133,null,null,null,null,null,null,null,null,198,null,null,null,null,213]
[1,"Yüksek-24",{"$f":"IF(ISERROR(VLOOKUP(B8,#REF!,2,0)),\"\",(VLOOKUP(B8,#REF!,2,0)))","v":""},{"$f":"IF(ISERROR(VLOOKUP(B8,#REF!,4,0)),\"\",(VLOOKUP(B8,#REF!,4,0)))","v":""},"CANAN FİL","FORD OTOSAN","O","O","-","-","O","O","O","O","O","O","XO","Xr",null,null,null,null,null,null,null,null,null,null,null,null,null,null,130,11,4]
[2,"Yüksek-7",{"$f":"IF(ISERROR(VLOOKUP(B9,#REF!,2,0)),\"\",(VLOOKUP(B9,#REF!,2,0)))","v":""},{"$f":"IF(ISERROR(VLOOKUP(B9,#REF!,4,0)),\"\",(VLOOKUP(B9,#REF!,4,0)))","v":""},"SİNEM BAŞ","TÜPRAŞ","-","-","-","-","O","O","O","O","XO","XXO","XXX",null,null,null,null,null,null,null,null,null,null,null,null,null,null,null,127,10,14]
[3,"Yüksek-25",{"$f":"IF(ISERROR(VLOOKUP(B10,#REF!,2,0)),\"\",(VLOOKUP(B10,#REF!,2,0)))","v":""},{"$f":"IF(ISERROR(VLOOKUP(B10,#REF!,4,0)),\"\",(VLOOKUP(B10,#REF!,4,0)))","v":""},"İNCİ ÖZDEMİR","FORD OTOSAN","O","O","-","-","O","O","XXO","XO","XXO","XXX",null,null,null,null,null,null,null,null,null,null,null,null,null,null,null,null,124,"-"]
[4,"Yüksek-2",{"$f":"IF(ISERROR(VLOOKUP(B11,#REF!,2,0)),\"\",(VLOOKUP(B11,#REF!,2,0)))","v":""},{"$f":"IF(ISERROR(VLOOKUP(B11,#REF!,4,0)),\"\",(VLOOKUP(B11,#REF!,4,0)))","v":""},"BETÜL ÖZYAY","ARÇELİK","O","O","O","O","XO","XO","XXO","O","XXO","XXX",null,null,null,null,null,null,null,null,null,null,null,null,null,null,null,null,124,9,6]
[5,"Yüksek-5",{"$f":"IF(ISERROR(VLOOKUP(B12,#REF!,2,0)),\"\",(VLOOKUP(B12,#REF!,2,0)))","v":""},{"$f":"IF(ISERROR(VLOOKUP(B12,#REF!,4,0)),\"\",(VLOOKUP(B12,#REF!,4,0)))","v":""},"BİNAR KALKANLAR","TÜPRAŞ","O","O","O","O","O","O","O","O","XXX",null,null,null,null,null,null,null,null,null,null,null,null,null,null,null,null,null,121,"-",14]
[6,"Yüksek-22",{"$f":"IF(ISERROR(VLOOKUP(B13,#REF!,2,0)),\"\",(VLOOKUP(B13,#REF!,2,0)))","v":""},{"$f":"IF(ISERROR(VLOOKUP(B13,#REF!,4,0)),\"\",(VLOOKUP(B13,#REF!,4,0)))","v":""},"İPEK AVCILAR","YAPI KREDİ","O","O","O","O","O","XXX",null,null,null,null,null,null,null,null,null,null,null,null,null,null,null,null,null,null,null,null,110,8,4]
[7,"Yüksek-6",{"$f":"IF(ISERROR(VLOOKUP(B14,#REF!,2,0)),\"\",(VLOOKUP(B14,#REF!,2,0)))","v":""},{"$f":"IF(ISERROR(VLOOKUP(B14,#REF!,4,0)),\"\",(VLOOKUP(B14,#REF!,4,0)))","v":""},"AYŞEGÜL BAYRAK","YAPI KREDİ","O","O","O","O","XXX",null,null,null,null,null,null,null,null,null,null,null,null,null,null,null,null,null,null,null,null,null,105,"-",2]
[8,"Yüksek-11",{"$f":"IF(ISERROR(VLOOKUP(B15,#REF!,2,0)),\"\",(VLOOKUP(B15,#REF!,2,0)))","v":""},{"$f":"IF(ISERROR(VLOOKUP(B15,#REF!,4,0)),\"\",(VLOOKUP(B15,#REF!,4,0)))","v":""},"SERAP YÜKSEK","TOFAŞ","XO","O","O","O","XXX",null,null,null,null,null,null,null,null,null,null,null,null,null,null,null,null,null,null,null,null,null,105,7,16]
[9,"Yüksek-13",{"$f":"IF(ISERROR(VLOOKUP(B16,#REF!,2,0)),\"\",(VLOOKUP(B16,#REF!,2,0)))","v":""},{"$f":"IF(ISERROR(VLOOKUP(B16,#REF!,4,0)),\"\",(VLOOKUP(B16,#REF!,4,0)))","v":""},"CEMİLE ALİBAŞOĞLU","TOFAŞ","-","O","O","XXX",null,null,null,null,null,null,null,null,null,null,null,null,null,null,null,null,null,null,null,null,null,null,100,"-",17]
[10,null,null,null,"ÖZLEM KURT","ZER","O","XO","XO","XXX",null,null,null,null,null,null,null,null,null,null,null,null,null,null,null,null,null,null,null,null,null,null,100,6]
["-","Yüksek-15",{"$f":"IF(ISERROR(VLOOKUP(B18,#REF!,2,0)),\"\",(VLOOKUP(B18,#REF!,2,0)))","v":""},{"$f":"IF(ISERROR(VLOOKUP(B18,#REF!,4,0)),\"\",(VLOOKUP(B18,#REF!,4,0)))","v":""},"GİZAY ULUTAŞ","ZER","XXX",null,null,null,null,null,null,null,null,null,null,null,null,null,null,null,null,null,null,null,null,null,null,null,null,null,"NM","-","-"]
["-",null,null,null,"DENİZ ILGINER","ZER","XXX",null,null,null,null,null,null,null,null,null,null,null,null,null,null,null,null,null,null,null,null,null,null,null,null,null,"NM","-"]
["-",null,null,null,"HÜLYA ÇALIKOĞLU","ZER","Xr",null,null,null,null,null,null,null,null,null,null,null,null,null,null,null,null,null,null,null,null,null,null,null,null,null,"NM","-"]
["-","Yüksek-3",{"$f":"IF(ISERROR(VLOOKUP(B21,#REF!,2,0)),\"\",(VLOOKUP(B21,#REF!,2,0)))","v":""},{"$f":"IF(ISERROR(VLOOKUP(B21,#REF!,4,0)),\"\",(VLOOKUP(B21,#REF!,4,0)))","v":""},"ESİN YILMAZ","YAPI KREDİ",null,null,null,null,null,null,null,null,null,null,null,null,null,null,null,null,null,null,null,null,null,null,null,null,null,null,"DNS",null,3]
["-","Yüksek-23",{"$f":"IF(ISERROR(VLOOKUP(B22,#REF!,2,0)),\"\",(VLOOKUP(B22,#REF!,2,0)))","v":""},{"$f":"IF(ISERROR(VLOOKUP(B22,#REF!,4,0)),\"\",(VLOOKUP(B22,#REF!,4,0)))","v":""},"EDA ERDİK","OPET",null,null,null,null,null,null,null,null,null,null,null,null,null,null,null,null,null,null,null,null,null,null,null,null,null,null,"DNS",null,7]
["-","Yüksek-12",{"$f":"IF(ISERROR(VLOOKUP(B23,#REF!,2,0)),\"\",(VLOOKUP(B23,#REF!,2,0)))","v":""},{"$f":"IF(ISERROR(VLOOKUP(B23,#REF!,4,0)),\"\",(VLOOKUP(B23,#REF!,4,0)))","v":""},"BURCU GÜNEL","OPET",null,null,null,null,null,null,null,null,null,null,null,null,null,null,null,null,null,null,null,null,null,null,null,null,null,null,"DNS",null,8]
["-","Yüksek-18",{"$f":"IF(ISERROR(VLOOKUP(B24,#REF!,2,0)),\"\",(VLOOKUP(B24,#REF!,2,0)))","v":""},{"$f":"IF(ISERROR(VLOOKUP(B24,#REF!,4,0)),\"\",(VLOOKUP(B24,#REF!,4,0)))","v":""},"BEGÜM CANSU DEMİR","OPET",null,null,null,null,null,null,null,null,null,null,null,null,null,null,null,null,null,null,null,null,null,null,null,null,null,null,"DNS",null,9]
["-","Yüksek-16",{"$f":"IF(ISERROR(VLOOKUP(B25,#REF!,2,0)),\"\",(VLOOKUP(B25,#REF!,2,0)))","v":""},{"$f":"IF(ISERROR(VLOOKUP(B25,#REF!,4,0)),\"\",(VLOOKUP(B25,#REF!,4,0)))","v":""},"DUYGU CESUR BOLAT","OPET",null,null,null,null,null,null,null,null,null,null,null,null,null,null,null,null,null,null,null,null,null,null,null,null,null,null,"DNS",null,10]
["-","Yüksek-1",{"$f":"IF(ISERROR(VLOOKUP(B26,#REF!,2,0)),\"\",(VLOOKUP(B26,#REF!,2,0)))","v":""},{"$f":"IF(ISERROR(VLOOKUP(B26,#REF!,4,0)),\"\",(VLOOKUP(B26,#REF!,4,0)))","v":""},"DİDEM EREL","TOFAŞ",null,null,null,null,null,null,null,null,null,null,null,null,null,null,null,null,null,null,null,null,null,null,null,null,null,null,"DNS",null,18]
["-","Yüksek-8",{"$f":"IF(ISERROR(VLOOKUP(B27,#REF!,2,0)),\"\",(VLOOKUP(B27,#REF!,2,0)))","v":""},{"$f":"IF(ISERROR(VLOOKUP(B27,#REF!,4,0)),\"\",(VLOOKUP(B27,#REF!,4,0)))","v":""},"ÜLVİYE DERYA COŞKUN","ZER",null,null,null,null,null,null,null,null,null,null,null,null,null,null,null,null,null,null,null,null,null,null,null,null,null,null,"DNS",null,18]
["-","Yüksek-17",{"$f":"IF(ISERROR(VLOOKUP(B28,#REF!,2,0)),\"\",(VLOOKUP(B28,#REF!,2,0)))","v":""},{"$f":"IF(ISERROR(VLOOKUP(B28,#REF!,4,0)),\"\",(VLOOKUP(B28,#REF!,4,0)))","v":""},"ÇİĞDEM KABİL ŞİMŞEK","ZER",null,null,null,null,null,null,null,null,null,null,null,null,null,null,null,null,null,null,null,null,null,null,null,null,null,null,"DNS",null,20]
["-","Yüksek-20",{"$f":"IF(ISERROR(VLOOKUP(B29,#REF!,2,0)),\"\",(VLOOKUP(B29,#REF!,2,0)))","v":""},{"$f":"IF(ISERROR(VLOOKUP(B29,#REF!,4,0)),\"\",(VLOOKUP(B29,#REF!,4,0)))","v":""},"ÜLKÜ BİRİŞİK ATEŞ","ZER",null,null,null,null,null,null,null,null,null,null,null,null,null,null,null,null,null,null,null,null,null,null,null,null,null,null,"DNS",null,"-"]
["-","Yüksek-21",{"$f":"IF(ISERROR(VLOOKUP(B30,#REF!,2,0)),\"\",(VLOOKUP(B30,#REF!,2,0)))","v":""},{"$f":"IF(ISERROR(VLOOKUP(B30,#REF!,4,0)),\"\",(VLOOKUP(B30,#REF!,4,0)))","v":""},"AYFER ÇEKÇİ","ZER",null,null,null,null,null,null,null,null,null,null,null,null,null,null,null,null,null,null,null,null,null,null,null,null,null,null,"DNS",null,"-"]
["-",null,null,null,"EZGİ ORAN","ZER",null,null,null,null,null,null,null,null,null,null,null,null,null,null,null,null,null,null,null,null,null,null,null,null,null,null,"DNS"]
["-","Yüksek-10",{"$f":"IF(ISERROR(VLOOKUP(B32,#REF!,2,0)),\"\",(VLOOKUP(B32,#REF!,2,0)))","v":""},{"$f":"IF(ISERROR(VLOOKUP(B32,#REF!,4,0)),\"\",(VLOOKUP(B32,#REF!,4,0)))","v":""},"SEDA KARAKOÇ","ZER",null,null,null,null,null,null,null,null,null,null,null,null,null,null,null,null,null,null,null,null,null,null,null,null,null,null,"DNS",null,"-"]
[]
["Müsabaka Direktörü",null,null,null,null,"Baş Hakem",null,null,null,"Lider",null,null,null,null,null,null,null,null,"Sekreter",null,null,null,null,null,null,null,"Hakem",null,null,null,null,null,"Hakem"]

{"sheet":"Uzun","index":10,"n_rows":42,"n_cols":13,"rows_kept":42,"cut":false,"hidden":false,"merged":[[5,12,6,12],[5,0,6,0],[41,6,41,9],[5,5,6,5],[41,10,41,11],[41,0,41,3],[5,2,6,2],[5,10,6,10],[5,1,6,1],[5,11,6,11],[5,3,6,3],[5,4,6,4],[5,6,5,9],[0,0,0,12],[1,0,1,12],[4,10,4,11],[2,3,2,4],[3,0,3,2],[3,9,3,11],[2,0,2,2],[3,3,3,4]]}
[]
[{"$f":"'YARIŞMA BİLGİLERİ'!F19","v":"KOÇ TOPLULUĞU SPOR ŞENLİĞİ PUANLI ATLETİZM YARIŞLARI"}]
["Yarışma :",null,null,{"$f":"'YARIŞMA PROGRAMI'!C13","v":"Uzun Atlama"}]
["Kategori :      ",null,null,{"$f":"'YARIŞMA BİLGİLERİ'!F21","v":"Kadınlar"},null,null,null,null,"Tarih-Saat  :",{"$f":"'YARIŞMA PROGRAMI'!B13","v":"2017-04-15T10:15:00"}]
[null,null,null,null,null,null,null,null,null,null,{"$f":"NOW()","v":42842.612082291664}]
["SIRA NO",null,"GÖĞÜS NO","DOĞUM TARİHİ\nGün/Ay/Yıl","ADI VE SOYADI","TAKIMI","A  T  L A M  A  L  A  R",null,null,null,"SONUÇ","PUAN","RÜZGAR"]
[null,null,null,null,null,null,1,2,3,4]
[1,"UZUN-3",{"$f":"IF(ISERROR(VLOOKUP(B8,#REF!,2,0)),\"\",(VLOOKUP(B8,#REF!,2,0)))","v":""},{"$f":"IF(ISERROR(VLOOKUP(B8,#REF!,4,0)),\"\",(VLOOKUP(B8,#REF!,4,0)))","v":""},"CANAN FİL","FORD OTOSAN",397,502,null,null,{"$f":"MAX(G8:J8)","v":502},11]
[2,"UZUN-1",{"$f":"IF(ISERROR(VLOOKUP(B9,#REF!,2,0)),\"\",(VLOOKUP(B9,#REF!,2,0)))","v":""},{"$f":"IF(ISERROR(VLOOKUP(B9,#REF!,4,0)),\"\",(VLOOKUP(B9,#REF!,4,0)))","v":""},"SEMA KUNUK","FORD OTOSAN",408,394,415,377,415,"-"]
[3,"UZUN-8",{"$f":"IF(ISERROR(VLOOKUP(B10,#REF!,2,0)),\"\",(VLOOKUP(B10,#REF!,2,0)))","v":""},{"$f":"IF(ISERROR(VLOOKUP(B10,#REF!,4,0)),\"\",(VLOOKUP(B10,#REF!,4,0)))","v":""},"KADER GÜNGÖR","OPET",385,361,372,362,385,10]
[4,"UZUN-13",{"$f":"IF(ISERROR(VLOOKUP(B11,#REF!,2,0)),\"\",(VLOOKUP(B11,#REF!,2,0)))","v":""},{"$f":"IF(ISERROR(VLOOKUP(B11,#REF!,4,0)),\"\",(VLOOKUP(B11,#REF!,4,0)))","v":""},"İPEK AVCILAR","YAPI KREDİ",353,"-","X",382,382,9]
[5,null,null,null,"BETÜL ÖZAY","ARÇELİK","X",374,329,360,374,8]
[6,"UZUN-7",{"$f":"IF(ISERROR(VLOOKUP(B13,#REF!,2,0)),\"\",(VLOOKUP(B13,#REF!,2,0)))","v":""},{"$f":"IF(ISERROR(VLOOKUP(B13,#REF!,4,0)),\"\",(VLOOKUP(B13,#REF!,4,0)))","v":""},"ESİN YILMAZ","YAPI KREDİ",353,359,"X",372,372,"-"]
[7,null,null,null,"SİNEM BAŞ","TÜPRAŞ",356,356,null,null,356,7]
[8,null,null,null,"TÜRKAN KORKMAZ","TOFAŞ","-",337,295,253,337,6]
[9,"UZUN-18",{"$f":"IF(ISERROR(VLOOKUP(B16,#REF!,2,0)),\"\",(VLOOKUP(B16,#REF!,2,0)))","v":""},{"$f":"IF(ISERROR(VLOOKUP(B16,#REF!,4,0)),\"\",(VLOOKUP(B16,#REF!,4,0)))","v":""},"BURCU UMAY","YAPI KREDİ",299,319,null,null,319,"-"]
[10,"UZUN-5",{"$f":"IF(ISERROR(VLOOKUP(B17,#REF!,2,0)),\"\",(VLOOKUP(B17,#REF!,2,0)))","v":""},{"$f":"IF(ISERROR(VLOOKUP(B17,#REF!,4,0)),\"\",(VLOOKUP(B17,#REF!,4,0)))","v":""},"ECEMSU HANGÜL","KOÇ SİSTEM",295,315,null,null,315,5]
[11,null,null,null,"ESİN KORKUT","ARÇELİK","X",313,null,null,313,"-"]
[12,null,null,null,"RUKİYE DİNDAR","TOFAŞ",286,306,null,null,306,"-"]
[13,"UZUN-2",{"$f":"IF(ISERROR(VLOOKUP(B20,#REF!,2,0)),\"\",(VLOOKUP(B20,#REF!,2,0)))","v":""},{"$f":"IF(ISERROR(VLOOKUP(B20,#REF!,4,0)),\"\",(VLOOKUP(B20,#REF!,4,0)))","v":""},"AYSU EGELİ","ARÇELİK",206,266,null,null,266,"-"]
[14,"UZUN-4",{"$f":"IF(ISERROR(VLOOKUP(B21,#REF!,2,0)),\"\",(VLOOKUP(B21,#REF!,2,0)))","v":""},{"$f":"IF(ISERROR(VLOOKUP(B21,#REF!,4,0)),\"\",(VLOOKUP(B21,#REF!,4,0)))","v":""},"BEGÜM CANSU DEMİR","OPET","X",263,null,null,263,"-"]
[15,"UZUN-12",{"$f":"IF(ISERROR(VLOOKUP(B22,#REF!,2,0)),\"\",(VLOOKUP(B22,#REF!,2,0)))","v":""},{"$f":"IF(ISERROR(VLOOKUP(B22,#REF!,4,0)),\"\",(VLOOKUP(B22,#REF!,4,0)))","v":""},"BURCU FERDA YILMAZ","YAPI KREDİ","X",257,null,null,257,"-"]
[16,"UZUN-13",{"$f":"IF(ISERROR(VLOOKUP(B23,#REF!,2,0)),\"\",(VLOOKUP(B23,#REF!,2,0)))","v":""},{"$f":"IF(ISERROR(VLOOKUP(B23,#REF!,4,0)),\"\",(VLOOKUP(B23,#REF!,4,0)))","v":""},"EZGİ ORAN","ZER",173,218,null,null,218,4]
[17,"UZUN-10",{"$f":"IF(ISERROR(VLOOKUP(B24,#REF!,2,0)),\"\",(VLOOKUP(B24,#REF!,2,0)))","v":""},{"$f":"IF(ISERROR(VLOOKUP(B24,#REF!,4,0)),\"\",(VLOOKUP(B24,#REF!,4,0)))","v":""},"MELİKE ERBAŞI","ZER",215,190,null,null,215,"-"]
[18,"UZUN-15",{"$f":"IF(ISERROR(VLOOKUP(B25,#REF!,2,0)),\"\",(VLOOKUP(B25,#REF!,2,0)))","v":""},{"$f":"IF(ISERROR(VLOOKUP(B25,#REF!,4,0)),\"\",(VLOOKUP(B25,#REF!,4,0)))","v":""},"GİZAY ULUTAŞ","ZER",208,212,null,null,212,"-"]
[19,"UZUN-14",{"$f":"IF(ISERROR(VLOOKUP(B26,#REF!,2,0)),\"\",(VLOOKUP(B26,#REF!,2,0)))","v":""},{"$f":"IF(ISERROR(VLOOKUP(B26,#REF!,4,0)),\"\",(VLOOKUP(B26,#REF!,4,0)))","v":""},"ÖZLEM KURT","ZER",200,204,null,null,204,"-"]
[20,"UZUN-21",{"$f":"IF(ISERROR(VLOOKUP(B27,#REF!,2,0)),\"\",(VLOOKUP(B27,#REF!,2,0)))","v":""},{"$f":"IF(ISERROR(VLOOKUP(B27,#REF!,4,0)),\"\",(VLOOKUP(B27,#REF!,4,0)))","v":""},"DENİZ ILGINER","ZER",203,"X",null,null,203,"-"]
["-","UZUN-22",{"$f":"IF(ISERROR(VLOOKUP(B28,#REF!,2,0)),\"\",(VLOOKUP(B28,#REF!,2,0)))","v":""},{"$f":"IF(ISERROR(VLOOKUP(B28,#REF!,4,0)),\"\",(VLOOKUP(B28,#REF!,4,0)))","v":""},"HÜLYA ÇALIKOĞLU","ZER","X","X",null,null,"NM"]
["-","UZUN-9",{"$f":"IF(ISERROR(VLOOKUP(B29,#REF!,2,0)),\"\",(VLOOKUP(B29,#REF!,2,0)))","v":""},{"$f":"IF(ISERROR(VLOOKUP(B29,#REF!,4,0)),\"\",(VLOOKUP(B29,#REF!,4,0)))","v":""},"EDA ERDİK","OPET",null,null,null,null,"DNS","-"]
["-","UZUN-16",{"$f":"IF(ISERROR(VLOOKUP(B30,#REF!,2,0)),\"\",(VLOOKUP(B30,#REF!,2,0)))","v":""},{"$f":"IF(ISERROR(VLOOKUP(B30,#REF!,4,0)),\"\",(VLOOKUP(B30,#REF!,4,0)))","v":""},"BURCU GÜNEL","OPET",null,null,null,null,"DNS","-"]
["-","UZUN-23",{"$f":"IF(ISERROR(VLOOKUP(B31,#REF!,2,0)),\"\",(VLOOKUP(B31,#REF!,2,0)))","v":""},{"$f":"IF(ISERROR(VLOOKUP(B31,#REF!,4,0)),\"\",(VLOOKUP(B31,#REF!,4,0)))","v":""},"DUYGU CESUR BOLAT","OPET",null,null,null,null,"DNS"]
["-",null,null,null,"DİDEM EREL","TOFAŞ",null,null,null,null,"DNS","-"]
["-","UZUN-17",{"$f":"IF(ISERROR(VLOOKUP(B33,#REF!,2,0)),\"\",(VLOOKUP(B33,#REF!,2,0)))","v":""},{"$f":"IF(ISERROR(VLOOKUP(B33,#REF!,4,0)),\"\",(VLOOKUP(B33,#REF!,4,0)))","v":""},"ÜLVİYE DERYA COŞKUN","ZER",null,null,null,null,"DNS","-"]
["-","UZUN-11",{"$f":"IF(ISERROR(VLOOKUP(B34,#REF!,2,0)),\"\",(VLOOKUP(B34,#REF!,2,0)))","v":""},{"$f":"IF(ISERROR(VLOOKUP(B34,#REF!,4,0)),\"\",(VLOOKUP(B34,#REF!,4,0)))","v":""},"ÇİĞDEM KABİL ŞİMŞEK","ZER",null,null,null,null,"DNS","-"]
["-","UZUN-20",{"$f":"IF(ISERROR(VLOOKUP(B35,#REF!,2,0)),\"\",(VLOOKUP(B35,#REF!,2,0)))","v":""},{"$f":"IF(ISERROR(VLOOKUP(B35,#REF!,4,0)),\"\",(VLOOKUP(B35,#REF!,4,0)))","v":""},"SEDA KARAKOÇ","ZER",null,null,null,null,"DNS","-"]
["-","UZUN-19",{"$f":"IF(ISERROR(VLOOKUP(B36,#REF!,2,0)),\"\",(VLOOKUP(B36,#REF!,2,0)))","v":""},{"$f":"IF(ISERROR(VLOOKUP(B36,#REF!,4,0)),\"\",(VLOOKUP(B36,#REF!,4,0)))","v":""},"ÜLKÜ BİRİŞİK ATEŞ","ZER",null,null,null,null,"DNS","-"]
["-","UZUN-6",{"$f":"IF(ISERROR(VLOOKUP(B37,#REF!,2,0)),\"\",(VLOOKUP(B37,#REF!,2,0)))","v":""},{"$f":"IF(ISERROR(VLOOKUP(B37,#REF!,4,0)),\"\",(VLOOKUP(B37,#REF!,4,0)))","v":""},"AYFER ÇEKÇİ","ZER",null,null,null,null,"DNS","-"]
[null,"UZUN-24",{"$f":"IF(ISERROR(VLOOKUP(B38,#REF!,2,0)),\"\",(VLOOKUP(B38,#REF!,2,0)))","v":""},{"$f":"IF(ISERROR(VLOOKUP(B38,#REF!,4,0)),\"\",(VLOOKUP(B38,#REF!,4,0)))","v":""},{"$f":"IF(ISERROR(VLOOKUP(B38,#REF!,5,0)),\"\",(VLOOKUP(B38,#REF!,5,0)))","v":""},{"$f":"IF(ISERROR(VLOOKUP(B38,#REF!,6,0)),\"\",(VLOOKUP(B38,#REF!,6,0)))","v":""},null,null,null,null,{"$f":"MAX(G38:J38)","v":0}]
[null,"UZUN-25",{"$f":"IF(ISERROR(VLOOKUP(B39,#REF!,2,0)),\"\",(VLOOKUP(B39,#REF!,2,0)))","v":""},{"$f":"IF(ISERROR(VLOOKUP(B39,#REF!,4,0)),\"\",(VLOOKUP(B39,#REF!,4,0)))","v":""},{"$f":"IF(ISERROR(VLOOKUP(B39,#REF!,5,0)),\"\",(VLOOKUP(B39,#REF!,5,0)))","v":""},{"$f":"IF(ISERROR(VLOOKUP(B39,#REF!,6,0)),\"\",(VLOOKUP(B39,#REF!,6,0)))","v":""},null,null,null,null,{"$f":"MAX(G39:J39)","v":0}]
[null,"UZUN-27",{"$f":"IF(ISERROR(VLOOKUP(B40,#REF!,2,0)),\"\",(VLOOKUP(B40,#REF!,2,0)))","v":""},{"$f":"IF(ISERROR(VLOOKUP(B40,#REF!,4,0)),\"\",(VLOOKUP(B40,#REF!,4,0)))","v":""},{"$f":"IF(ISERROR(VLOOKUP(B40,#REF!,5,0)),\"\",(VLOOKUP(B40,#REF!,5,0)))","v":""},{"$f":"IF(ISERROR(VLOOKUP(B40,#REF!,6,0)),\"\",(VLOOKUP(B40,#REF!,6,0)))","v":""},null,null,null,null,{"$f":"MAX(G40:J40)","v":0}]
[]
["Müsabaka \nDirektörü",null,null,null,"Baş Hakem","Lider","Sekreter",null,null,null,"Hakem"]

{"sheet":"Gülle","index":11,"n_rows":27,"n_cols":13,"rows_kept":27,"cut":false,"hidden":false,"merged":[[5,1,6,1],[26,0,26,3],[26,6,26,9],[26,10,26,11],[4,10,4,11],[5,6,5,9],[5,3,6,3],[3,7,3,8],[5,12,6,12],[0,0,0,12],[1,0,1,12],[5,11,6,11],[5,0,6,0],[3,0,3,2],[3,3,3,4],[5,4,6,4],[5,10,6,10],[5,5,6,5],[2,0,2,2],[2,3,2,4],[3,9,3,11],[2,6,2,7],[5,2,6,2]]}
[]
[{"$f":"'YARIŞMA BİLGİLERİ'!F19","v":"KOÇ TOPLULUĞU SPOR ŞENLİĞİ PUANLI ATLETİZM YARIŞLARI"}]
["Yarışma :",null,null,"Gülle Atma"]
["Kategori :      ",null,null,{"$f":"'YARIŞMA BİLGİLERİ'!F21","v":"Kadınlar"},null,null,null,"Tarih-Saat  :",null,{"$f":"'YARIŞMA PROGRAMI'!B14","v":"2017-04-15T10:15:00"}]
[null,null,null,null,null,null,null,null,null,null,{"$f":"NOW()","v":42842.612082291664}]
["SIRA NO",null,"GÖĞÜS NO","DOĞUM TARİHİ\nGün/Ay/Yıl","ADI VE SOYADI","TAKIMI","A  T M  A  L  A  R",null,null,null,"SONUÇ","PUAN","KLASMAN"]
[null,null,null,null,null,null,1,2,3,4]
[1,"GÜLLE-4",{"$f":"IF(ISERROR(VLOOKUP(B8,#REF!,2,0)),\"\",(VLOOKUP(B8,#REF!,2,0)))","v":""},{"$f":"IF(ISERROR(VLOOKUP(B8,#REF!,4,0)),\"\",(VLOOKUP(B8,#REF!,4,0)))","v":""},"SEVCAN BALCI BEYPINAR","FORD OTOSAN",971,955,995,973,995,11]
[2,"GÜLLE-1",{"$f":"IF(ISERROR(VLOOKUP(B9,#REF!,2,0)),\"\",(VLOOKUP(B9,#REF!,2,0)))","v":""},{"$f":"IF(ISERROR(VLOOKUP(B9,#REF!,4,0)),\"\",(VLOOKUP(B9,#REF!,4,0)))","v":""},"SİNEM BAŞ","TÜPRAŞ","x",977,917,"x",{"$f":"MAX(G9:J9)","v":977},10]
[3,"GÜLLE-10",{"$f":"IF(ISERROR(VLOOKUP(B10,#REF!,2,0)),\"\",(VLOOKUP(B10,#REF!,2,0)))","v":""},{"$f":"IF(ISERROR(VLOOKUP(B10,#REF!,4,0)),\"\",(VLOOKUP(B10,#REF!,4,0)))","v":""},"MELEK KÜPÜÇ","TAT GIDA",846,890,874,880,890,"-"]
[4,"GÜLLE-3",{"$f":"IF(ISERROR(VLOOKUP(B11,#REF!,2,0)),\"\",(VLOOKUP(B11,#REF!,2,0)))","v":""},{"$f":"IF(ISERROR(VLOOKUP(B11,#REF!,4,0)),\"\",(VLOOKUP(B11,#REF!,4,0)))","v":""},"CANAN UZUN","TÜPRAŞ",788,819,831,823,831,"-"]
[5,"GÜLLE-18",{"$f":"IF(ISERROR(VLOOKUP(B12,#REF!,2,0)),\"\",(VLOOKUP(B12,#REF!,2,0)))","v":""},{"$f":"IF(ISERROR(VLOOKUP(B12,#REF!,4,0)),\"\",(VLOOKUP(B12,#REF!,4,0)))","v":""},"YURDAGÜL YILMAZ","ARÇELİK","X",783,771,799,799,9]
[6,"GÜLLE-15",{"$f":"IF(ISERROR(VLOOKUP(B13,#REF!,2,0)),\"\",(VLOOKUP(B13,#REF!,2,0)))","v":""},{"$f":"IF(ISERROR(VLOOKUP(B13,#REF!,4,0)),\"\",(VLOOKUP(B13,#REF!,4,0)))","v":""},"DİDEM EREL","TOFAŞ",713,757,773,771,773,8]
[7,"GÜLLE-7",{"$f":"IF(ISERROR(VLOOKUP(B14,#REF!,2,0)),\"\",(VLOOKUP(B14,#REF!,2,0)))","v":""},{"$f":"IF(ISERROR(VLOOKUP(B14,#REF!,4,0)),\"\",(VLOOKUP(B14,#REF!,4,0)))","v":""},"AYŞEN BİÇER","YAPI KREDİ",747,753,673,750,753,7]
[8,"GÜLLE-11",{"$f":"IF(ISERROR(VLOOKUP(B15,#REF!,2,0)),\"\",(VLOOKUP(B15,#REF!,2,0)))","v":""},{"$f":"IF(ISERROR(VLOOKUP(B15,#REF!,4,0)),\"\",(VLOOKUP(B15,#REF!,4,0)))","v":""},"TÜRKAN KORKMAZ","TOFAŞ",658,733,722,713,733,"-"]
[9,"GÜLLE-2",{"$f":"IF(ISERROR(VLOOKUP(B16,#REF!,2,0)),\"\",(VLOOKUP(B16,#REF!,2,0)))","v":""},{"$f":"IF(ISERROR(VLOOKUP(B16,#REF!,4,0)),\"\",(VLOOKUP(B16,#REF!,4,0)))","v":""},"ESİN YILMAZ","YAPI KREDİ",619,627,551,596,627,"-"]
[10,"GÜLLE-12",{"$f":"IF(ISERROR(VLOOKUP(B17,#REF!,2,0)),\"\",(VLOOKUP(B17,#REF!,2,0)))","v":""},{"$f":"IF(ISERROR(VLOOKUP(B17,#REF!,4,0)),\"\",(VLOOKUP(B17,#REF!,4,0)))","v":""},"ECEMSU HANGÜL","KOÇ SİSTEM",522,554,"-","r",554,6]
[11,"GÜLLE-16",{"$f":"IF(ISERROR(VLOOKUP(B18,#REF!,2,0)),\"\",(VLOOKUP(B18,#REF!,2,0)))","v":""},{"$f":"IF(ISERROR(VLOOKUP(B18,#REF!,4,0)),\"\",(VLOOKUP(B18,#REF!,4,0)))","v":""},"CEMİLE ALİBAŞOĞLU","TOFAŞ",394,520,495,552,552,"-"]
[12,"GÜLLE-20",{"$f":"IF(ISERROR(VLOOKUP(B19,#REF!,2,0)),\"\",(VLOOKUP(B19,#REF!,2,0)))","v":""},{"$f":"IF(ISERROR(VLOOKUP(B19,#REF!,4,0)),\"\",(VLOOKUP(B19,#REF!,4,0)))","v":""},"MELİKE ERBAŞI","ZER","x",526,536,496,536,5]
[13,"GÜLLE-20",{"$f":"IF(ISERROR(VLOOKUP(B20,#REF!,2,0)),\"\",(VLOOKUP(B20,#REF!,2,0)))","v":""},{"$f":"IF(ISERROR(VLOOKUP(B20,#REF!,4,0)),\"\",(VLOOKUP(B20,#REF!,4,0)))","v":""},"YELİZ ÜNEL","FORD OTOSAN",463,"X",515,535,535,"-"]
[14,"GÜLLE-9",{"$f":"IF(ISERROR(VLOOKUP(B21,#REF!,2,0)),\"\",(VLOOKUP(B21,#REF!,2,0)))","v":""},{"$f":"IF(ISERROR(VLOOKUP(B21,#REF!,4,0)),\"\",(VLOOKUP(B21,#REF!,4,0)))","v":""},"ZÜLEYHA ERBİL","YAPI KREDİ",448,471,481,481,481,"-"]
["-","GÜLLE-19",{"$f":"IF(ISERROR(VLOOKUP(B22,#REF!,2,0)),\"\",(VLOOKUP(B22,#REF!,2,0)))","v":""},{"$f":"IF(ISERROR(VLOOKUP(B22,#REF!,4,0)),\"\",(VLOOKUP(B22,#REF!,4,0)))","v":""},"AYFER ÇEKÇİ","ZER",null,null,null,null,"DNS","-"]
[null,"GÜLLE-13",{"$f":"IF(ISERROR(VLOOKUP(B23,#REF!,2,0)),\"\",(VLOOKUP(B23,#REF!,2,0)))","v":""},{"$f":"IF(ISERROR(VLOOKUP(B23,#REF!,4,0)),\"\",(VLOOKUP(B23,#REF!,4,0)))","v":""},{"$f":"IF(ISERROR(VLOOKUP(B23,#REF!,5,0)),\"\",(VLOOKUP(B23,#REF!,5,0)))","v":""},{"$f":"IF(ISERROR(VLOOKUP(B23,#REF!,6,0)),\"\",(VLOOKUP(B23,#REF!,6,0)))","v":""}]
[null,"GÜLLE-14",{"$f":"IF(ISERROR(VLOOKUP(B24,#REF!,2,0)),\"\",(VLOOKUP(B24,#REF!,2,0)))","v":""},{"$f":"IF(ISERROR(VLOOKUP(B24,#REF!,4,0)),\"\",(VLOOKUP(B24,#REF!,4,0)))","v":""},{"$f":"IF(ISERROR(VLOOKUP(B24,#REF!,5,0)),\"\",(VLOOKUP(B24,#REF!,5,0)))","v":""},{"$f":"IF(ISERROR(VLOOKUP(B24,#REF!,6,0)),\"\",(VLOOKUP(B24,#REF!,6,0)))","v":""}]
[null,"GÜLLE-17",{"$f":"IF(ISERROR(VLOOKUP(B25,#REF!,2,0)),\"\",(VLOOKUP(B25,#REF!,2,0)))","v":""},{"$f":"IF(ISERROR(VLOOKUP(B25,#REF!,4,0)),\"\",(VLOOKUP(B25,#REF!,4,0)))","v":""},{"$f":"IF(ISERROR(VLOOKUP(B25,#REF!,5,0)),\"\",(VLOOKUP(B25,#REF!,5,0)))","v":""},{"$f":"IF(ISERROR(VLOOKUP(B25,#REF!,6,0)),\"\",(VLOOKUP(B25,#REF!,6,0)))","v":""}]
[]
["Müsabaka \nDirektörü",null,null,null,"Baş Hakem","Lider","Sekreter",null,null,null,"Hakem"]

{"sheet":"4x100m.","index":12,"n_rows":37,"n_cols":17,"rows_kept":37,"cut":false,"hidden":false,"merged":[[0,0,0,16],[1,0,1,16],[2,0,2,2],[2,3,2,4],[2,5,2,6],[5,2,6,2],[2,13,2,16],[25,8,25,16],[5,6,6,6],[5,8,5,16],[15,8,15,16],[3,0,3,2],[3,3,3,4],[3,13,3,16],[5,0,6,0],[5,1,6,1],[2,8,2,11],[5,3,6,3],[5,4,6,4],[5,5,6,5],[4,13,4,16]]}
[]
[{"$f":"'YARIŞMA BİLGİLERİ'!F19","v":"KOÇ TOPLULUĞU SPOR ŞENLİĞİ PUANLI ATLETİZM YARIŞLARI"}]
["Yarışma :",null,null,{"$f":"'YARIŞMA PROGRAMI'!C16","v":"4x100 Metre"},null,null,null,null,{"$f":"'YARIŞMA PROGRAMI'!D16","v":0}]
["Kategori :",null,null,{"$f":"'YARIŞMA BİLGİLERİ'!F21","v":"Kadınlar"},null,null,null,null,null,null,null,null,"Tarih-Saat :",{"$f":"'YARIŞMA PROGRAMI'!B16","v":"2017-04-15T15:30:00"}]
[null,null,null,null,null,null,null,null,null,null,null,null,null,{"$f":"NOW()","v":42842.612082291664}]
["Sıra No","Göğüs No","Doğum Tarihi\nGün/Ay/Yıl","Adı ve Soyadı","TAKIMI","Derece","Puan",null,"1. SERİ"]
[null,null,null,null,null,null,null,null,"Kulvar","Formül","Göğüs No","Doğum Tarihi","Adı ve Soyadı","Takımı","Elektronik Kronometre","El Kronometre","Seri Geliş"]
[1,null,null,"SEMA KUNUK                   CANAN FİL                        FADİME ÖZKAN                  JALE YENGİNER","FORD OTOSAN",10132,11,null,1,"4X100M-1-1",{"$f":"IF(ISERROR(VLOOKUP(J8,#REF!,2,0)),\"\",(VLOOKUP(J8,#REF!,2,0)))","v":""},{"$f":"IF(ISERROR(VLOOKUP(J8,#REF!,4,0)),\"\",(VLOOKUP(J8,#REF!,4,0)))","v":""}]
[2,null,null,"AYLİN ÖZDEMİR               İPEK AVCILAR                      DEMET DURMUŞ                ESİN YILMAZ","YAPI KREDİ",10409,10,null,2,"4X100M-1-2",{"$f":"IF(ISERROR(VLOOKUP(J9,#REF!,2,0)),\"\",(VLOOKUP(J9,#REF!,2,0)))","v":""},{"$f":"IF(ISERROR(VLOOKUP(J9,#REF!,4,0)),\"\",(VLOOKUP(J9,#REF!,4,0)))","v":""}]
[3,null,null,"SİNEM BAŞ                        BİNAR KALKANLI             SELİN GÜVEN                   ECEM ERERMİŞ","TÜPRAŞ",10793,9,null,3,"4X100M-1-3",{"$f":"IF(ISERROR(VLOOKUP(J10,#REF!,2,0)),\"\",(VLOOKUP(J10,#REF!,2,0)))","v":""},{"$f":"IF(ISERROR(VLOOKUP(J10,#REF!,4,0)),\"\",(VLOOKUP(J10,#REF!,4,0)))","v":""},"SEMA KUNUK                   CANAN FİL                        FADİME ÖZKAN                  JALE YENGİNER","FORD OTOSAN",10132,null,1]
[4,null,null,"RUKİYE DİNDAR              DİDEM EREL                      SERAP YÜKSEK                 TÜRKAN KORKMAZ","TOFAŞ",11145,8,null,4,"4X100M-1-4",{"$f":"IF(ISERROR(VLOOKUP(J11,#REF!,2,0)),\"\",(VLOOKUP(J11,#REF!,2,0)))","v":""},{"$f":"IF(ISERROR(VLOOKUP(J11,#REF!,4,0)),\"\",(VLOOKUP(J11,#REF!,4,0)))","v":""},"DUYGU CESUR                  YETER GÜNGÖR                 AYCAN VAROL                  KADER GÜNGÖR","OPET",11396,null,3]
[5,null,null,"SİBEL MOL                        ZEYNEP ERPOLAT             SEDEF AĞAR                     YURDAGÜL YILMAZ ","ARÇELİK",11362,7,null,5,"4X100M-1-5",{"$f":"IF(ISERROR(VLOOKUP(J12,#REF!,2,0)),\"\",(VLOOKUP(J12,#REF!,2,0)))","v":""},{"$f":"IF(ISERROR(VLOOKUP(J12,#REF!,4,0)),\"\",(VLOOKUP(J12,#REF!,4,0)))","v":""}]
[6,null,null,"DUYGU CESUR                  YETER GÜNGÖR                 AYCAN VAROL                  KADER GÜNGÖR","OPET",11396,6,null,6,"4X100M-1-6",{"$f":"IF(ISERROR(VLOOKUP(J13,#REF!,2,0)),\"\",(VLOOKUP(J13,#REF!,2,0)))","v":""},{"$f":"IF(ISERROR(VLOOKUP(J13,#REF!,4,0)),\"\",(VLOOKUP(J13,#REF!,4,0)))","v":""},"RUKİYE DİNDAR              DİDEM EREL                      SERAP YÜKSEK                 TÜRKAN KORKMAZ","TOFAŞ",11145,null,2]
[null,null,null,null,null,null,null,null,7,"4X100M-1-7",{"$f":"IF(ISERROR(VLOOKUP(J14,#REF!,2,0)),\"\",(VLOOKUP(J14,#REF!,2,0)))","v":""},{"$f":"IF(ISERROR(VLOOKUP(J14,#REF!,4,0)),\"\",(VLOOKUP(J14,#REF!,4,0)))","v":""}]
[null,null,null,null,null,null,null,null,8,"4X100M-1-8",{"$f":"IF(ISERROR(VLOOKUP(J15,#REF!,2,0)),\"\",(VLOOKUP(J15,#REF!,2,0)))","v":""},{"$f":"IF(ISERROR(VLOOKUP(J15,#REF!,4,0)),\"\",(VLOOKUP(J15,#REF!,4,0)))","v":""},{"$f":"IF(ISERROR(VLOOKUP(J15,#REF!,5,0)),\"\",(VLOOKUP(J15,#REF!,5,0)))","v":""},{"$f":"IF(ISERROR(VLOOKUP(J15,#REF!,6,0)),\"\",(VLOOKUP(J15,#REF!,6,0)))","v":""}]
[null,null,null,null,null,null,null,null,"2. SERİ"]
[null,null,null,null,null,null,null,null,"Kulvar","Formül","Göğüs No","Doğum Tarihi","Adı ve Soyadı","Takımı","Elektronik Kronometre","El Kronometre","Seri Geliş"]
[null,null,null,null,null,null,null,null,1,"4X100M-2-1",{"$f":"IF(ISERROR(VLOOKUP(J18,#REF!,2,0)),\"\",(VLOOKUP(J18,#REF!,2,0)))","v":""},{"$f":"IF(ISERROR(VLOOKUP(J18,#REF!,4,0)),\"\",(VLOOKUP(J18,#REF!,4,0)))","v":""},{"$f":"IF(ISERROR(VLOOKUP(J18,#REF!,5,0)),\"\",(VLOOKUP(J18,#REF!,5,0)))","v":""},{"$f":"IF(ISERROR(VLOOKUP(J18,#REF!,6,0)),\"\",(VLOOKUP(J18,#REF!,6,0)))","v":""}]
[null,null,null,null,null,null,null,null,2,"4X100M-2-2",{"$f":"IF(ISERROR(VLOOKUP(J19,#REF!,2,0)),\"\",(VLOOKUP(J19,#REF!,2,0)))","v":""},{"$f":"IF(ISERROR(VLOOKUP(J19,#REF!,4,0)),\"\",(VLOOKUP(J19,#REF!,4,0)))","v":""},"AYLİN ÖZDEMİR               İPEK AVCILAR                      DEMET DURMUŞ                ESİN YILMAZ","YAPI KREDİ",10409,null,1]
[null,null,null,null,null,null,null,null,3,"4X100M-2-3",{"$f":"IF(ISERROR(VLOOKUP(J20,#REF!,2,0)),\"\",(VLOOKUP(J20,#REF!,2,0)))","v":""},{"$f":"IF(ISERROR(VLOOKUP(J20,#REF!,4,0)),\"\",(VLOOKUP(J20,#REF!,4,0)))","v":""},"SİBEL MOL                        ZEYNEP ERPOLAT             SEDEF AĞAR                     YURDAGÜL YILMAZ ","ARÇELİK",11362,null,3]
[null,null,null,null,null,null,null,null,4,"4X100M-2-4",{"$f":"IF(ISERROR(VLOOKUP(J21,#REF!,2,0)),\"\",(VLOOKUP(J21,#REF!,2,0)))","v":""},{"$f":"IF(ISERROR(VLOOKUP(J21,#REF!,4,0)),\"\",(VLOOKUP(J21,#REF!,4,0)))","v":""}]
[null,null,null,null,null,null,null,null,5,"4X100M-2-5",{"$f":"IF(ISERROR(VLOOKUP(J22,#REF!,2,0)),\"\",(VLOOKUP(J22,#REF!,2,0)))","v":""},{"$f":"IF(ISERROR(VLOOKUP(J22,#REF!,4,0)),\"\",(VLOOKUP(J22,#REF!,4,0)))","v":""},"SİNEM BAŞ                        BİNAR KALKANLI             SELİN GÜVEN                   ECEM ERERMİŞ","TÜPRAŞ",10793,null,2]
[null,null,null,null,null,null,null,null,6,"4X100M-2-6",{"$f":"IF(ISERROR(VLOOKUP(J23,#REF!,2,0)),\"\",(VLOOKUP(J23,#REF!,2,0)))","v":""},{"$f":"IF(ISERROR(VLOOKUP(J23,#REF!,4,0)),\"\",(VLOOKUP(J23,#REF!,4,0)))","v":""}]
[null,null,null,null,null,null,{"$f":"IF(ISTEXT(F24),\" \",IFERROR(VLOOKUP(SMALL(PUAN!$U$6:$V$110,COUNTIF(PUAN!$U$6:$V$110,\"<\"&F24)+1),PUAN!$U$6:$V$110,2,2),\"    \"))","v":"    "},null,7,"4X100M-2-7",{"$f":"IF(ISERROR(VLOOKUP(J24,#REF!,2,0)),\"\",(VLOOKUP(J24,#REF!,2,0)))","v":""},{"$f":"IF(ISERROR(VLOOKUP(J24,#REF!,4,0)),\"\",(VLOOKUP(J24,#REF!,4,0)))","v":""},{"$f":"IF(ISERROR(VLOOKUP(J24,#REF!,5,0)),\"\",(VLOOKUP(J24,#REF!,5,0)))","v":""},{"$f":"IF(ISERROR(VLOOKUP(J24,#REF!,6,0)),\"\",(VLOOKUP(J24,#REF!,6,0)))","v":""}]
[null,null,null,null,null,null,{"$f":"IF(ISTEXT(F25),\" \",IFERROR(VLOOKUP(SMALL(PUAN!$U$6:$V$110,COUNTIF(PUAN!$U$6:$V$110,\"<\"&F25)+1),PUAN!$U$6:$V$110,2,2),\"    \"))","v":"    "},null,8,"4X100M-2-8",{"$f":"IF(ISERROR(VLOOKUP(J25,#REF!,2,0)),\"\",(VLOOKUP(J25,#REF!,2,0)))","v":""},{"$f":"IF(ISERROR(VLOOKUP(J25,#REF!,4,0)),\"\",(VLOOKUP(J25,#REF!,4,0)))","v":""},{"$f":"IF(ISERROR(VLOOKUP(J25,#REF!,5,0)),\"\",(VLOOKUP(J25,#REF!,5,0)))","v":""},{"$f":"IF(ISERROR(VLOOKUP(J25,#REF!,6,0)),\"\",(VLOOKUP(J25,#REF!,6,0)))","v":""}]
[19,null,null,null,null,null,{"$f":"IF(ISTEXT(F26),\" \",IFERROR(VLOOKUP(SMALL(PUAN!$U$6:$V$110,COUNTIF(PUAN!$U$6:$V$110,\"<\"&F26)+1),PUAN!$U$6:$V$110,2,2),\"    \"))","v":"    "},null,"3. SERİ"]
[20,null,null,null,null,null,{"$f":"IF(ISTEXT(F27),\" \",IFERROR(VLOOKUP(SMALL(PUAN!$U$6:$V$110,COUNTIF(PUAN!$U$6:$V$110,\"<\"&F27)+1),PUAN!$U$6:$V$110,2,2),\"    \"))","v":"    "},null,"Kulvar","Formül","Göğüs No","Doğum Tarihi","Adı ve Soyadı","Okulu","Elektronik Kronometre","El Kronometre","Seri Geliş"]
[21,null,null,null,null,null,{"$f":"IF(ISTEXT(F28),\" \",IFERROR(VLOOKUP(SMALL(PUAN!$U$6:$V$110,COUNTIF(PUAN!$U$6:$V$110,\"<\"&F28)+1),PUAN!$U$6:$V$110,2,2),\"    \"))","v":"    "},null,1,"4X100M-3-1",{"$f":"IF(ISERROR(VLOOKUP(J28,#REF!,2,0)),\"\",(VLOOKUP(J28,#REF!,2,0)))","v":""},{"$f":"IF(ISERROR(VLOOKUP(J28,#REF!,4,0)),\"\",(VLOOKUP(J28,#REF!,4,0)))","v":""},{"$f":"IF(ISERROR(VLOOKUP(J28,#REF!,5,0)),\"\",(VLOOKUP(J28,#REF!,5,0)))","v":""},{"$f":"IF(ISERROR(VLOOKUP(J28,#REF!,6,0)),\"\",(VLOOKUP(J28,#REF!,6,0)))","v":""},{"$f":"IF(IF(OR(P28=\"NM\",P28=\"DNF\",P28=\"DNS\",P28=\"DQ\",P28=\"\"),P28,(ROUNDUP(P28,)+24))=0,\" \",IF(OR(P28=\"NM\",P28=\"DNF\",P28=\"DNS\",P28=\"DQ\",P28=\"\"),P28,(ROUNDUP(P28,)+24)))","v":" "}]
[22,null,null,null,null,null,{"$f":"IF(ISTEXT(F29),\" \",IFERROR(VLOOKUP(SMALL(PUAN!$U$6:$V$110,COUNTIF(PUAN!$U$6:$V$110,\"<\"&F29)+1),PUAN!$U$6:$V$110,2,2),\"    \"))","v":"    "},null,2,"4X100M-3-2",{"$f":"IF(ISERROR(VLOOKUP(J29,#REF!,2,0)),\"\",(VLOOKUP(J29,#REF!,2,0)))","v":""},{"$f":"IF(ISERROR(VLOOKUP(J29,#REF!,4,0)),\"\",(VLOOKUP(J29,#REF!,4,0)))","v":""},{"$f":"IF(ISERROR(VLOOKUP(J29,#REF!,5,0)),\"\",(VLOOKUP(J29,#REF!,5,0)))","v":""},{"$f":"IF(ISERROR(VLOOKUP(J29,#REF!,6,0)),\"\",(VLOOKUP(J29,#REF!,6,0)))","v":""}," "]
[23,null,null,null,null,null,{"$f":"IF(ISTEXT(F30),\" \",IFERROR(VLOOKUP(SMALL(PUAN!$U$6:$V$110,COUNTIF(PUAN!$U$6:$V$110,\"<\"&F30)+1),PUAN!$U$6:$V$110,2,2),\"    \"))","v":"    "},null,3,"4X100M-3-3",{"$f":"IF(ISERROR(VLOOKUP(J30,#REF!,2,0)),\"\",(VLOOKUP(J30,#REF!,2,0)))","v":""},{"$f":"IF(ISERROR(VLOOKUP(J30,#REF!,4,0)),\"\",(VLOOKUP(J30,#REF!,4,0)))","v":""},{"$f":"IF(ISERROR(VLOOKUP(J30,#REF!,5,0)),\"\",(VLOOKUP(J30,#REF!,5,0)))","v":""},{"$f":"IF(ISERROR(VLOOKUP(J30,#REF!,6,0)),\"\",(VLOOKUP(J30,#REF!,6,0)))","v":""}," "]
[24,null,null,null,null,null,{"$f":"IF(ISTEXT(F31),\" \",IFERROR(VLOOKUP(SMALL(PUAN!$U$6:$V$110,COUNTIF(PUAN!$U$6:$V$110,\"<\"&F31)+1),PUAN!$U$6:$V$110,2,2),\"    \"))","v":"    "},null,4,"4X100M-3-4",{"$f":"IF(ISERROR(VLOOKUP(J31,#REF!,2,0)),\"\",(VLOOKUP(J31,#REF!,2,0)))","v":""},{"$f":"IF(ISERROR(VLOOKUP(J31,#REF!,4,0)),\"\",(VLOOKUP(J31,#REF!,4,0)))","v":""},{"$f":"IF(ISERROR(VLOOKUP(J31,#REF!,5,0)),\"\",(VLOOKUP(J31,#REF!,5,0)))","v":""},{"$f":"IF(ISERROR(VLOOKUP(J31,#REF!,6,0)),\"\",(VLOOKUP(J31,#REF!,6,0)))","v":""}," "]
[25,null,null,null,null,null,{"$f":"IF(ISTEXT(F32),\" \",IFERROR(VLOOKUP(SMALL(PUAN!$U$6:$V$110,COUNTIF(PUAN!$U$6:$V$110,\"<\"&F32)+1),PUAN!$U$6:$V$110,2,2),\"    \"))","v":"    "},null,5,"4X100M-3-5",{"$f":"IF(ISERROR(VLOOKUP(J32,#REF!,2,0)),\"\",(VLOOKUP(J32,#REF!,2,0)))","v":""},{"$f":"IF(ISERROR(VLOOKUP(J32,#REF!,4,0)),\"\",(VLOOKUP(J32,#REF!,4,0)))","v":""},{"$f":"IF(ISERROR(VLOOKUP(J32,#REF!,5,0)),\"\",(VLOOKUP(J32,#REF!,5,0)))","v":""},{"$f":"IF(ISERROR(VLOOKUP(J32,#REF!,6,0)),\"\",(VLOOKUP(J32,#REF!,6,0)))","v":""}," "]
[26,null,null,null,null,null,{"$f":"IF(ISTEXT(F33),\" \",IFERROR(VLOOKUP(SMALL(PUAN!$U$6:$V$110,COUNTIF(PUAN!$U$6:$V$110,\"<\"&F33)+1),PUAN!$U$6:$V$110,2,2),\"    \"))","v":"    "},null,6,"4X100M-3-6",{"$f":"IF(ISERROR(VLOOKUP(J33,#REF!,2,0)),\"\",(VLOOKUP(J33,#REF!,2,0)))","v":""},{"$f":"IF(ISERROR(VLOOKUP(J33,#REF!,4,0)),\"\",(VLOOKUP(J33,#REF!,4,0)))","v":""},{"$f":"IF(ISERROR(VLOOKUP(J33,#REF!,5,0)),\"\",(VLOOKUP(J33,#REF!,5,0)))","v":""},{"$f":"IF(ISERROR(VLOOKUP(J33,#REF!,6,0)),\"\",(VLOOKUP(J33,#REF!,6,0)))","v":""}," "]
[27,null,null,null,null,null,{"$f":"IF(ISTEXT(F34),\" \",IFERROR(VLOOKUP(SMALL(PUAN!$U$6:$V$110,COUNTIF(PUAN!$U$6:$V$110,\"<\"&F34)+1),PUAN!$U$6:$V$110,2,2),\"    \"))","v":"    "},null,7,"4X100M-3-7",{"$f":"IF(ISERROR(VLOOKUP(J34,#REF!,2,0)),\"\",(VLOOKUP(J34,#REF!,2,0)))","v":""},{"$f":"IF(ISERROR(VLOOKUP(J34,#REF!,4,0)),\"\",(VLOOKUP(J34,#REF!,4,0)))","v":""},{"$f":"IF(ISERROR(VLOOKUP(J34,#REF!,5,0)),\"\",(VLOOKUP(J34,#REF!,5,0)))","v":""},{"$f":"IF(ISERROR(VLOOKUP(J34,#REF!,6,0)),\"\",(VLOOKUP(J34,#REF!,6,0)))","v":""}," "]
[28,null,null,null,null,null,{"$f":"IF(ISTEXT(F35),\" \",IFERROR(VLOOKUP(SMALL(PUAN!$U$6:$V$110,COUNTIF(PUAN!$U$6:$V$110,\"<\"&F35)+1),PUAN!$U$6:$V$110,2,2),\"    \"))","v":"    "},null,8,"4X100M-3-8",{"$f":"IF(ISERROR(VLOOKUP(J35,#REF!,2,0)),\"\",(VLOOKUP(J35,#REF!,2,0)))","v":""},{"$f":"IF(ISERROR(VLOOKUP(J35,#REF!,4,0)),\"\",(VLOOKUP(J35,#REF!,4,0)))","v":""},{"$f":"IF(ISERROR(VLOOKUP(J35,#REF!,5,0)),\"\",(VLOOKUP(J35,#REF!,5,0)))","v":""},{"$f":"IF(ISERROR(VLOOKUP(J35,#REF!,6,0)),\"\",(VLOOKUP(J35,#REF!,6,0)))","v":""}," "]
[]
["Müsabakalar Direktörü",null,null,null,"Baş Hakem","Lider",null,"Sekreter",null,null,null,null,"Hakem","Hakem",null,"Hakem"]

{"sheet":"İsveç","index":13,"n_rows":37,"n_cols":17,"rows_kept":37,"cut":false,"hidden":false,"merged":[[5,6,6,6],[5,8,5,16],[15,8,15,16],[25,8,25,16],[3,0,3,2],[3,3,3,4],[3,13,3,16],[4,13,4,16],[5,0,6,0],[5,1,6,1],[5,2,6,2],[5,3,6,3],[5,4,6,4],[5,5,6,5],[0,0,0,16],[1,0,1,16],[2,0,2,2],[2,3,2,4],[2,5,2,6],[2,8,2,11],[2,13,2,16]]}
[]
[{"$f":"'YARIŞMA BİLGİLERİ'!F19","v":"KOÇ TOPLULUĞU SPOR ŞENLİĞİ PUANLI ATLETİZM YARIŞLARI"}]
["Yarışma :",null,null,{"$f":"'YARIŞMA PROGRAMI'!C17","v":"İsveç Bayrak"},null,null,null,null,{"$f":"'YARIŞMA PROGRAMI'!D16","v":0}]
["Kategori :",null,null,{"$f":"'YARIŞMA BİLGİLERİ'!F21","v":"Kadınlar"},null,null,null,null,null,null,null,null,"Tarih-Saat :",{"$f":"'YARIŞMA PROGRAMI'!B16","v":"2017-04-15T15:30:00"}]
[null,null,null,null,null,null,null,null,null,null,null,null,null,{"$f":"NOW()","v":42842.612082291664}]
["Sıra No","Göğüs No","Doğum Tarihi\nGün/Ay/Yıl","Adı ve Soyadı","TAKIMI","Derece","Puan",null,"1. SERİ"]
[null,null,null,null,null,null,null,null,"Kulvar","Formül","Göğüs No","Doğum Tarihi","Adı ve Soyadı","Takımı","Elektronik Kronometre","El Kronometre","Seri Geliş"]
[1,null,null,"CANAN FİL                          İNCİ ÖZDEMİR                     FADİME ÖZKAN                 JALE YEĞİNER","FORD OTOSAN",25823,11,null,1,"4X100M-1-1",{"$f":"IF(ISERROR(VLOOKUP(J8,#REF!,2,0)),\"\",(VLOOKUP(J8,#REF!,2,0)))","v":""},{"$f":"IF(ISERROR(VLOOKUP(J8,#REF!,4,0)),\"\",(VLOOKUP(J8,#REF!,4,0)))","v":""},"MERVE AKIN                      AYŞEGÜL BAYRAK             DEMET OĞUZTÜRK            CEREN ANGILI","YAPI KREDİ",31848,null,3]
[2,null,null,"SİNEM BAŞ                          ECEM ERERMİŞ                ZEYNEP DÜZGÖREN             BİNAR KALKANLI","TÜPRAŞ",31134,10,null,2,"4X100M-1-2",{"$f":"IF(ISERROR(VLOOKUP(J9,#REF!,2,0)),\"\",(VLOOKUP(J9,#REF!,2,0)))","v":""},{"$f":"IF(ISERROR(VLOOKUP(J9,#REF!,4,0)),\"\",(VLOOKUP(J9,#REF!,4,0)))","v":""},"SİBEL MOL                          SEDEF AĞIR                         SİMGE                                  YURDAGÜL YILMAZ","ARÇELİK",32418,null,4]
[3,null,null,"MERVE AKIN                      AYŞEGÜL BAYRAK             DEMET OĞUZTÜRK            CEREN ANGILI","YAPI KREDİ",31848,9,null,3,"4X100M-1-3",{"$f":"IF(ISERROR(VLOOKUP(J10,#REF!,2,0)),\"\",(VLOOKUP(J10,#REF!,2,0)))","v":""},{"$f":"IF(ISERROR(VLOOKUP(J10,#REF!,4,0)),\"\",(VLOOKUP(J10,#REF!,4,0)))","v":""},"CANAN FİL                          İNCİ ÖZDEMİR                     FADİME ÖZKAN                 JALE YEĞİNER","FORD OTOSAN","DQ",null,"170\\7"]
[4,null,null,"SİBEL MOL                          SEDEF AĞIR                         SİMGE                                  YURDAGÜL YILMAZ","ARÇELİK",32418,8,null,4,"4X100M-1-4",{"$f":"IF(ISERROR(VLOOKUP(J11,#REF!,2,0)),\"\",(VLOOKUP(J11,#REF!,2,0)))","v":""},{"$f":"IF(ISERROR(VLOOKUP(J11,#REF!,4,0)),\"\",(VLOOKUP(J11,#REF!,4,0)))","v":""},"SİNEM BAŞ                          ECEM ERERMİŞ                ZEYNEP DÜZGÖREN             BİNAR KALKANLI","TÜPRAŞ",31134,null,2]
[5,null,null,"RUKİYE DİNDAR               TÜRKAN KORKMAZ          DİDEM EREL                       SERAP YÜKSEK","TOFAŞ",32460,7,null,5,"4X100M-1-5",{"$f":"IF(ISERROR(VLOOKUP(J12,#REF!,2,0)),\"\",(VLOOKUP(J12,#REF!,2,0)))","v":""},{"$f":"IF(ISERROR(VLOOKUP(J12,#REF!,4,0)),\"\",(VLOOKUP(J12,#REF!,4,0)))","v":""},"EZGİ ORAN                            GİZAY ULUTAŞ                  HÜLYA ÇALIKOĞLU            ÖZLEM KURT","ZER",35910,null,6]
[6,null,null,"EZGİ ORAN                            GİZAY ULUTAŞ                  HÜLYA ÇALIKOĞLU            ÖZLEM KURT","ZER",35910,6,null,6,"4X100M-1-6",{"$f":"IF(ISERROR(VLOOKUP(J13,#REF!,2,0)),\"\",(VLOOKUP(J13,#REF!,2,0)))","v":""},{"$f":"IF(ISERROR(VLOOKUP(J13,#REF!,4,0)),\"\",(VLOOKUP(J13,#REF!,4,0)))","v":""},"RUKİYE DİNDAR               TÜRKAN KORKMAZ          DİDEM EREL                       SERAP YÜKSEK","TOFAŞ",32460,null,5]
[null,null,null,null,null,null,null,null,7,"4X100M-1-7",{"$f":"IF(ISERROR(VLOOKUP(J14,#REF!,2,0)),\"\",(VLOOKUP(J14,#REF!,2,0)))","v":""},{"$f":"IF(ISERROR(VLOOKUP(J14,#REF!,4,0)),\"\",(VLOOKUP(J14,#REF!,4,0)))","v":""},{"$f":"IF(ISERROR(VLOOKUP(J14,#REF!,5,0)),\"\",(VLOOKUP(J14,#REF!,5,0)))","v":""},{"$f":"IF(ISERROR(VLOOKUP(J14,#REF!,6,0)),\"\",(VLOOKUP(J14,#REF!,6,0)))","v":""}]
[null,null,null,null,null,null,null,null,8,"4X100M-1-8",{"$f":"IF(ISERROR(VLOOKUP(J15,#REF!,2,0)),\"\",(VLOOKUP(J15,#REF!,2,0)))","v":""},{"$f":"IF(ISERROR(VLOOKUP(J15,#REF!,4,0)),\"\",(VLOOKUP(J15,#REF!,4,0)))","v":""},{"$f":"IF(ISERROR(VLOOKUP(J15,#REF!,5,0)),\"\",(VLOOKUP(J15,#REF!,5,0)))","v":""},{"$f":"IF(ISERROR(VLOOKUP(J15,#REF!,6,0)),\"\",(VLOOKUP(J15,#REF!,6,0)))","v":""}]
[null,null,null,null,null,null,null,null,"2. SERİ"]
[null,null,null,null,null,null,null,null,"Kulvar","Formül","Göğüs No","Doğum Tarihi","Adı ve Soyadı","Takımı","Elektronik Kronometre","El Kronometre","Seri Geliş"]
[null,null,null,null,null,null,null,null,1,"4X100M-2-1",{"$f":"IF(ISERROR(VLOOKUP(J18,#REF!,2,0)),\"\",(VLOOKUP(J18,#REF!,2,0)))","v":""},{"$f":"IF(ISERROR(VLOOKUP(J18,#REF!,4,0)),\"\",(VLOOKUP(J18,#REF!,4,0)))","v":""},{"$f":"IF(ISERROR(VLOOKUP(J18,#REF!,5,0)),\"\",(VLOOKUP(J18,#REF!,5,0)))","v":""},{"$f":"IF(ISERROR(VLOOKUP(J18,#REF!,6,0)),\"\",(VLOOKUP(J18,#REF!,6,0)))","v":""}]
[null,null,null,null,null,null,null,null,2,"4X100M-2-2",{"$f":"IF(ISERROR(VLOOKUP(J19,#REF!,2,0)),\"\",(VLOOKUP(J19,#REF!,2,0)))","v":""},{"$f":"IF(ISERROR(VLOOKUP(J19,#REF!,4,0)),\"\",(VLOOKUP(J19,#REF!,4,0)))","v":""},"DİSKALİFİYE SEBEBİYLE 2. KEZ KOŞTURULU."]
[null,null,null,null,null,null,null,null,3,"4X100M-2-3",{"$f":"IF(ISERROR(VLOOKUP(J20,#REF!,2,0)),\"\",(VLOOKUP(J20,#REF!,2,0)))","v":""},{"$f":"IF(ISERROR(VLOOKUP(J20,#REF!,4,0)),\"\",(VLOOKUP(J20,#REF!,4,0)))","v":""},"CANAN FİL                          İNCİ ÖZDEMİR                     FADİME ÖZKAN                 JALE YEĞİNER","FORD OTOSAN",25823,null,1]
["-",null,null,null,null,null,null,null,4,"4X100M-2-4",{"$f":"IF(ISERROR(VLOOKUP(J21,#REF!,2,0)),\"\",(VLOOKUP(J21,#REF!,2,0)))","v":""},{"$f":"IF(ISERROR(VLOOKUP(J21,#REF!,4,0)),\"\",(VLOOKUP(J21,#REF!,4,0)))","v":""},{"$f":"IF(ISERROR(VLOOKUP(J21,#REF!,5,0)),\"\",(VLOOKUP(J21,#REF!,5,0)))","v":""}]
["-",null,null,null,null,null,null,null,5,"4X100M-2-5",{"$f":"IF(ISERROR(VLOOKUP(J22,#REF!,2,0)),\"\",(VLOOKUP(J22,#REF!,2,0)))","v":""},{"$f":"IF(ISERROR(VLOOKUP(J22,#REF!,4,0)),\"\",(VLOOKUP(J22,#REF!,4,0)))","v":""}]
["-",null,null,null,null,null,null,null,6,"4X100M-2-6",{"$f":"IF(ISERROR(VLOOKUP(J23,#REF!,2,0)),\"\",(VLOOKUP(J23,#REF!,2,0)))","v":""},{"$f":"IF(ISERROR(VLOOKUP(J23,#REF!,4,0)),\"\",(VLOOKUP(J23,#REF!,4,0)))","v":""}]
[null,null,null,null,null,null,{"$f":"IF(ISTEXT(F24),\" \",IFERROR(VLOOKUP(SMALL(PUAN!$U$6:$V$110,COUNTIF(PUAN!$U$6:$V$110,\"<\"&F24)+1),PUAN!$U$6:$V$110,2,2),\"    \"))","v":"    "},null,7,"4X100M-2-7",{"$f":"IF(ISERROR(VLOOKUP(J24,#REF!,2,0)),\"\",(VLOOKUP(J24,#REF!,2,0)))","v":""},{"$f":"IF(ISERROR(VLOOKUP(J24,#REF!,4,0)),\"\",(VLOOKUP(J24,#REF!,4,0)))","v":""},{"$f":"IF(ISERROR(VLOOKUP(J24,#REF!,5,0)),\"\",(VLOOKUP(J24,#REF!,5,0)))","v":""},{"$f":"IF(ISERROR(VLOOKUP(J24,#REF!,6,0)),\"\",(VLOOKUP(J24,#REF!,6,0)))","v":""}]
[null,null,null,null,null,null,{"$f":"IF(ISTEXT(F25),\" \",IFERROR(VLOOKUP(SMALL(PUAN!$U$6:$V$110,COUNTIF(PUAN!$U$6:$V$110,\"<\"&F25)+1),PUAN!$U$6:$V$110,2,2),\"    \"))","v":"    "},null,8,"4X100M-2-8",{"$f":"IF(ISERROR(VLOOKUP(J25,#REF!,2,0)),\"\",(VLOOKUP(J25,#REF!,2,0)))","v":""},{"$f":"IF(ISERROR(VLOOKUP(J25,#REF!,4,0)),\"\",(VLOOKUP(J25,#REF!,4,0)))","v":""},{"$f":"IF(ISERROR(VLOOKUP(J25,#REF!,5,0)),\"\",(VLOOKUP(J25,#REF!,5,0)))","v":""},{"$f":"IF(ISERROR(VLOOKUP(J25,#REF!,6,0)),\"\",(VLOOKUP(J25,#REF!,6,0)))","v":""}]
[19,null,null,null,null,null,{"$f":"IF(ISTEXT(F26),\" \",IFERROR(VLOOKUP(SMALL(PUAN!$U$6:$V$110,COUNTIF(PUAN!$U$6:$V$110,\"<\"&F26)+1),PUAN!$U$6:$V$110,2,2),\"    \"))","v":"    "},null,"3. SERİ"]
[20,null,null,null,null,null,{"$f":"IF(ISTEXT(F27),\" \",IFERROR(VLOOKUP(SMALL(PUAN!$U$6:$V$110,COUNTIF(PUAN!$U$6:$V$110,\"<\"&F27)+1),PUAN!$U$6:$V$110,2,2),\"    \"))","v":"    "},null,"Kulvar","Formül","Göğüs No","Doğum Tarihi","Adı ve Soyadı","Okulu","Elektronik Kronometre","El Kronometre","Seri Geliş"]
[21,null,null,null,null,null,{"$f":"IF(ISTEXT(F28),\" \",IFERROR(VLOOKUP(SMALL(PUAN!$U$6:$V$110,COUNTIF(PUAN!$U$6:$V$110,\"<\"&F28)+1),PUAN!$U$6:$V$110,2,2),\"    \"))","v":"    "},null,1,"4X100M-3-1",{"$f":"IF(ISERROR(VLOOKUP(J28,#REF!,2,0)),\"\",(VLOOKUP(J28,#REF!,2,0)))","v":""},{"$f":"IF(ISERROR(VLOOKUP(J28,#REF!,4,0)),\"\",(VLOOKUP(J28,#REF!,4,0)))","v":""},{"$f":"IF(ISERROR(VLOOKUP(J28,#REF!,5,0)),\"\",(VLOOKUP(J28,#REF!,5,0)))","v":""},{"$f":"IF(ISERROR(VLOOKUP(J28,#REF!,6,0)),\"\",(VLOOKUP(J28,#REF!,6,0)))","v":""},{"$f":"IF(IF(OR(P28=\"NM\",P28=\"DNF\",P28=\"DNS\",P28=\"DQ\",P28=\"\"),P28,(ROUNDUP(P28,)+24))=0,\" \",IF(OR(P28=\"NM\",P28=\"DNF\",P28=\"DNS\",P28=\"DQ\",P28=\"\"),P28,(ROUNDUP(P28,)+24)))","v":" "}]
[22,null,null,null,null,null,{"$f":"IF(ISTEXT(F29),\" \",IFERROR(VLOOKUP(SMALL(PUAN!$U$6:$V$110,COUNTIF(PUAN!$U$6:$V$110,\"<\"&F29)+1),PUAN!$U$6:$V$110,2,2),\"    \"))","v":"    "},null,2,"4X100M-3-2",{"$f":"IF(ISERROR(VLOOKUP(J29,#REF!,2,0)),\"\",(VLOOKUP(J29,#REF!,2,0)))","v":""},{"$f":"IF(ISERROR(VLOOKUP(J29,#REF!,4,0)),\"\",(VLOOKUP(J29,#REF!,4,0)))","v":""},{"$f":"IF(ISERROR(VLOOKUP(J29,#REF!,5,0)),\"\",(VLOOKUP(J29,#REF!,5,0)))","v":""},{"$f":"IF(ISERROR(VLOOKUP(J29,#REF!,6,0)),\"\",(VLOOKUP(J29,#REF!,6,0)))","v":""}," "]
[23,null,null,null,null,null,{"$f":"IF(ISTEXT(F30),\" \",IFERROR(VLOOKUP(SMALL(PUAN!$U$6:$V$110,COUNTIF(PUAN!$U$6:$V$110,\"<\"&F30)+1),PUAN!$U$6:$V$110,2,2),\"    \"))","v":"    "},null,3,"4X100M-3-3",{"$f":"IF(ISERROR(VLOOKUP(J30,#REF!,2,0)),\"\",(VLOOKUP(J30,#REF!,2,0)))","v":""},{"$f":"IF(ISERROR(VLOOKUP(J30,#REF!,4,0)),\"\",(VLOOKUP(J30,#REF!,4,0)))","v":""},{"$f":"IF(ISERROR(VLOOKUP(J30,#REF!,5,0)),\"\",(VLOOKUP(J30,#REF!,5,0)))","v":""},{"$f":"IF(ISERROR(VLOOKUP(J30,#REF!,6,0)),\"\",(VLOOKUP(J30,#REF!,6,0)))","v":""}," "]
[24,null,null,null,null,null,{"$f":"IF(ISTEXT(F31),\" \",IFERROR(VLOOKUP(SMALL(PUAN!$U$6:$V$110,COUNTIF(PUAN!$U$6:$V$110,\"<\"&F31)+1),PUAN!$U$6:$V$110,2,2),\"    \"))","v":"    "},null,4,"4X100M-3-4",{"$f":"IF(ISERROR(VLOOKUP(J31,#REF!,2,0)),\"\",(VLOOKUP(J31,#REF!,2,0)))","v":""},{"$f":"IF(ISERROR(VLOOKUP(J31,#REF!,4,0)),\"\",(VLOOKUP(J31,#REF!,4,0)))","v":""},{"$f":"IF(ISERROR(VLOOKUP(J31,#REF!,5,0)),\"\",(VLOOKUP(J31,#REF!,5,0)))","v":""},{"$f":"IF(ISERROR(VLOOKUP(J31,#REF!,6,0)),\"\",(VLOOKUP(J31,#REF!,6,0)))","v":""}," "]
[25,null,null,null,null,null,{"$f":"IF(ISTEXT(F32),\" \",IFERROR(VLOOKUP(SMALL(PUAN!$U$6:$V$110,COUNTIF(PUAN!$U$6:$V$110,\"<\"&F32)+1),PUAN!$U$6:$V$110,2,2),\"    \"))","v":"    "},null,5,"4X100M-3-5",{"$f":"IF(ISERROR(VLOOKUP(J32,#REF!,2,0)),\"\",(VLOOKUP(J32,#REF!,2,0)))","v":""},{"$f":"IF(ISERROR(VLOOKUP(J32,#REF!,4,0)),\"\",(VLOOKUP(J32,#REF!,4,0)))","v":""},{"$f":"IF(ISERROR(VLOOKUP(J32,#REF!,5,0)),\"\",(VLOOKUP(J32,#REF!,5,0)))","v":""},{"$f":"IF(ISERROR(VLOOKUP(J32,#REF!,6,0)),\"\",(VLOOKUP(J32,#REF!,6,0)))","v":""}," "]
[26,null,null,null,null,null,{"$f":"IF(ISTEXT(F33),\" \",IFERROR(VLOOKUP(SMALL(PUAN!$U$6:$V$110,COUNTIF(PUAN!$U$6:$V$110,\"<\"&F33)+1),PUAN!$U$6:$V$110,2,2),\"    \"))","v":"    "},null,6,"4X100M-3-6",{"$f":"IF(ISERROR(VLOOKUP(J33,#REF!,2,0)),\"\",(VLOOKUP(J33,#REF!,2,0)))","v":""},{"$f":"IF(ISERROR(VLOOKUP(J33,#REF!,4,0)),\"\",(VLOOKUP(J33,#REF!,4,0)))","v":""},{"$f":"IF(ISERROR(VLOOKUP(J33,#REF!,5,0)),\"\",(VLOOKUP(J33,#REF!,5,0)))","v":""},{"$f":"IF(ISERROR(VLOOKUP(J33,#REF!,6,0)),\"\",(VLOOKUP(J33,#REF!,6,0)))","v":""}," "]
[27,null,null,null,null,null,{"$f":"IF(ISTEXT(F34),\" \",IFERROR(VLOOKUP(SMALL(PUAN!$U$6:$V$110,COUNTIF(PUAN!$U$6:$V$110,\"<\"&F34)+1),PUAN!$U$6:$V$110,2,2),\"    \"))","v":"    "},null,7,"4X100M-3-7",{"$f":"IF(ISERROR(VLOOKUP(J34,#REF!,2,0)),\"\",(VLOOKUP(J34,#REF!,2,0)))","v":""},{"$f":"IF(ISERROR(VLOOKUP(J34,#REF!,4,0)),\"\",(VLOOKUP(J34,#REF!,4,0)))","v":""},{"$f":"IF(ISERROR(VLOOKUP(J34,#REF!,5,0)),\"\",(VLOOKUP(J34,#REF!,5,0)))","v":""},{"$f":"IF(ISERROR(VLOOKUP(J34,#REF!,6,0)),\"\",(VLOOKUP(J34,#REF!,6,0)))","v":""}," "]
[28,null,null,null,null,null,{"$f":"IF(ISTEXT(F35),\" \",IFERROR(VLOOKUP(SMALL(PUAN!$U$6:$V$110,COUNTIF(PUAN!$U$6:$V$110,\"<\"&F35)+1),PUAN!$U$6:$V$110,2,2),\"    \"))","v":"    "},null,8,"4X100M-3-8",{"$f":"IF(ISERROR(VLOOKUP(J35,#REF!,2,0)),\"\",(VLOOKUP(J35,#REF!,2,0)))","v":""},{"$f":"IF(ISERROR(VLOOKUP(J35,#REF!,4,0)),\"\",(VLOOKUP(J35,#REF!,4,0)))","v":""},{"$f":"IF(ISERROR(VLOOKUP(J35,#REF!,5,0)),\"\",(VLOOKUP(J35,#REF!,5,0)))","v":""},{"$f":"IF(ISERROR(VLOOKUP(J35,#REF!,6,0)),\"\",(VLOOKUP(J35,#REF!,6,0)))","v":""}," "]
[]
["Müsabakalar Direktörü",null,null,null,"Baş Hakem","Lider",null,"Sekreter",null,null,null,null,"Hakem","Hakem",null,"Hakem"]

{"sheet":"Genel Puan Tablosu","index":14,"n_rows":22,"n_cols":24,"rows_kept":22,"cut":false,"hidden":false,"merged":[[5,23,6,23],[4,16,4,23],[1,0,1,23],[2,0,2,23],[3,0,3,23],[5,0,6,0],[5,1,6,1],[5,7,5,8],[5,3,5,4],[4,13,4,15],[5,9,5,10],[5,5,5,6],[5,2,6,2],[5,13,5,14],[5,15,5,16],[5,17,5,18],[5,19,5,20],[5,21,5,22],[25,5,25,6],[25,9,25,10],[5,11,5,12],[23,0,23,15],[24,0,24,15],[25,1,26,1],[25,13,26,13],[25,3,25,4],[25,7,25,8],[25,11,25,12],[25,15,26,15],[25,14,26,14],[25,0,26,0],[25,2,26,2]]}
[]
[{"$f":"'YARIŞMA BİLGİLERİ'!F19","v":"KOÇ TOPLULUĞU SPOR ŞENLİĞİ PUANLI ATLETİZM YARIŞLARI"}]
["GENEL PUAN TABLOSU "]
[{"$f":"'YARIŞMA BİLGİLERİ'!F21","v":"Kadınlar"}]
[null,null,null,null,null,null,null,null,null,null,null,null,null,{"$f":"'YARIŞMA PROGRAMI'!B18","v":"2017-04-15T15:30:00"}]
["SIRA","TAKIMI",null,"100 METRE",null,"200 METRE",null,"800 METRE",null,"YÜKSEK ATLAMA",null,"GÜLLE ATMA",null,"UZUN ATLAMA",null,"3000 METRE",null,"400 METRE",null,"4X100 METRE",null,"İSVEÇ BAYRAK",null,"GENEL PUAN"]
[null,null,null,"DERECE","PUAN","DERECE","PUAN","DERECE","PUAN","DERECE","PUAN","DERECE","PUAN","DERECE","PUAN","DERECE","PUAN","DERECE","PUAN","DERECE","PUAN","DERECE","PUAN"]
[1,"FORD OTOSAN",null,{"$f":"VLOOKUP(B8,'100m.'!E:F,2,0)","v":1425},{"$f":"VLOOKUP(B8,'100m.'!E:G,3,0)","v":11},{"$f":"VLOOKUP(B8,'200m.'!E:F,2,0)","v":3365},{"$f":"VLOOKUP(B8,'200m.'!E:G,3,0)","v":11},{"$f":"VLOOKUP(B8,'800m.'!E:F,2,0)","v":30026},{"$f":"VLOOKUP(B8,'800m.'!E:G,3,0)","v":11},130,11,995,11,502,11,{"$f":"VLOOKUP(B8,'3000m.'!E:F,2,0)","v":131270},{"$f":"VLOOKUP(B8,'3000m.'!E:G,3,0)","v":11},{"$f":"VLOOKUP(B8,'400m.'!E:F,2,0)","v":11460},{"$f":"VLOOKUP(B8,'400m.'!E:G,3,0)","v":11},{"$f":"VLOOKUP(B8,'4x100m.'!E:F,2,0)","v":10132},{"$f":"VLOOKUP(B8,'4x100m.'!E:G,3,0)","v":11},25823,11,{"$f":"SUM(E8,G8,I8,K8,M8,O8,Q8,S8,U8,W8)","v":110}]
[2,"TÜPRAŞ",null,{"$f":"VLOOKUP(B9,'100m.'!E:F,2,0)","v":1596},10,{"$f":"VLOOKUP(B9,'200m.'!E:F,2,0)","v":3495},{"$f":"VLOOKUP(B9,'200m.'!E:G,3,0)","v":10},{"$f":"VLOOKUP(B9,'800m.'!E:F,2,0)","v":33081},{"$f":"VLOOKUP(B9,'800m.'!E:G,3,0)","v":9},127,10,977,10,356,7,{"$f":"VLOOKUP(B9,'3000m.'!E:F,2,0)","v":132626},{"$f":"VLOOKUP(B9,'3000m.'!E:G,3,0)","v":10},{"$f":"VLOOKUP(B9,'400m.'!E:F,2,0)","v":12139},{"$f":"VLOOKUP(B9,'400m.'!E:G,3,0)","v":9},{"$f":"VLOOKUP(B9,'4x100m.'!E:F,2,0)","v":10793},{"$f":"VLOOKUP(B9,'4x100m.'!E:G,3,0)","v":9},31134,10,94]
[3,"YAPI KREDİ ",null,1656,9,3903,7,32491,10,110,8,753,7,382,9,143204,9,11719,10,10409,10,31848,9,88]
[4,"ARÇELİK",null,{"$f":"VLOOKUP(B11,'100m.'!E:F,2,0)","v":"DNS"},{"$f":"VLOOKUP(B11,'100m.'!E:G,3,0)","v":0},{"$f":"VLOOKUP(B11,'200m.'!E:F,2,0)","v":4138},{"$f":"VLOOKUP(B11,'200m.'!E:G,3,0)","v":6},{"$f":"VLOOKUP(B11,'800m.'!E:F,2,0)","v":34494},{"$f":"VLOOKUP(B11,'800m.'!E:G,3,0)","v":8},124,9,799,9,374,8,{"$f":"VLOOKUP(B11,'3000m.'!E:F,2,0)","v":182902},{"$f":"VLOOKUP(B11,'3000m.'!E:G,3,0)","v":8},{"$f":"VLOOKUP(B11,'400m.'!E:F,2,0)","v":12896},{"$f":"VLOOKUP(B11,'400m.'!E:G,3,0)","v":8},{"$f":"VLOOKUP(B11,'4x100m.'!E:F,2,0)","v":11362},{"$f":"VLOOKUP(B11,'4x100m.'!E:G,3,0)","v":7},32418,8,71]
[5,"TOFAŞ",null,{"$f":"VLOOKUP(B12,'100m.'!E:F,2,0)","v":1938},8,{"$f":"VLOOKUP(B12,'200m.'!E:F,2,0)","v":3829},{"$f":"VLOOKUP(B12,'200m.'!E:G,3,0)","v":8},{"$f":"VLOOKUP(B12,'800m.'!E:F,2,0)","v":34973},{"$f":"VLOOKUP(B12,'800m.'!E:G,3,0)","v":7},105,7,773,8,337,6,"DNS",0,{"$f":"VLOOKUP(B12,'400m.'!E:F,2,0)","v":"DNF"},0,{"$f":"VLOOKUP(B12,'4x100m.'!E:F,2,0)","v":11145},{"$f":"VLOOKUP(B12,'4x100m.'!E:G,3,0)","v":8},32460,7,59]
[6,"ZER",null,{"$f":"VLOOKUP(B13,'100m.'!E:F,2,0)","v":1959},7,{"$f":"VLOOKUP(B13,'200m.'!E:F,2,0)","v":4249},{"$f":"VLOOKUP(B13,'200m.'!E:G,3,0)","v":5},{"$f":"VLOOKUP(B13,'800m.'!E:F,2,0)","v":35879},{"$f":"VLOOKUP(B13,'800m.'!E:G,3,0)","v":6},100,6,536,5,218,4,{"$f":"VLOOKUP(B13,'3000m.'!E:F,2,0)","v":193434},{"$f":"VLOOKUP(B13,'3000m.'!E:G,3,0)","v":6},{"$f":"VLOOKUP(B13,'400m.'!E:F,2,0)","v":13426},{"$f":"VLOOKUP(B13,'400m.'!E:G,3,0)","v":7},"DNS",0,35910,6,52]
[7,"OPET",null,"DNS",0,{"$f":"VLOOKUP(B14,'200m.'!E:F,2,0)","v":4427},{"$f":"VLOOKUP(B14,'200m.'!E:G,3,0)","v":4},{"$f":"VLOOKUP(B14,'800m.'!E:F,2,0)","v":"DNS"},0,"DNS",0,"DNS",0,385,10,"DNS",0,{"$f":"VLOOKUP(B14,'400m.'!E:F,2,0)","v":14991},{"$f":"VLOOKUP(B14,'400m.'!E:G,3,0)","v":6},{"$f":"VLOOKUP(B14,'4x100m.'!E:F,2,0)","v":11396},{"$f":"VLOOKUP(B14,'4x100m.'!E:G,3,0)","v":6},"DNS",0,26]
[8,"KOÇ SİSTEM",null,"DNS",0,{"$f":"VLOOKUP(B15,'200m.'!E:F,2,0)","v":3823},{"$f":"VLOOKUP(B15,'200m.'!E:G,3,0)","v":9},"DNS",0,"DNS",0,554,6,315,5,{"$f":"VLOOKUP(B15,'3000m.'!E:F,2,0)","v":"DNS"},0,"DNS",0,"DNS",0,"DNS",0,20]
[9,"OTOKAR",null,"DNS",0,"DNS",0,"DNS",0,"DNS",0,"DNS",0,"DNS",0,{"$f":"VLOOKUP(B16,'3000m.'!E:F,2,0)","v":192956},{"$f":"VLOOKUP(B16,'3000m.'!E:G,3,0)","v":7},"DNS",0,"DNS",0,"DNS",0,7]
["-","VKV SAĞLIK KURULUŞLARI",null,"DNS",0,{"$f":"VLOOKUP(B17,'200m.'!E:F,2,0)","v":"DNS"},0,{"$f":"VLOOKUP(B17,'800m.'!E:F,2,0)","v":"DNS"},0,"DNS",0,"DNS",0,"DNS",0,{"$f":"VLOOKUP(B17,'3000m.'!E:F,2,0)","v":"DNS"},0,{"$f":"VLOOKUP(B17,'400m.'!E:F,2,0)","v":"DNS"},0,"DNS",0,"DNS",0,0]
[null,null,null,{"$f":"IF(ISERROR(VLOOKUP(B18,'100m.'!$E$8:$F$1010,2,0)),\"\",(VLOOKUP(B18,'100m.'!$E$8:$H$1010,2,0)))","v":""},{"$f":"IF(ISERROR(VLOOKUP(B18,'100m.'!$E$8:$G$1010,3,0)),\"\",(VLOOKUP(B18,'100m.'!$E$8:$G$1010,3,0)))","v":""},{"$f":"IF(ISERROR(VLOOKUP(B18,'200m.'!$E$8:$F$1000,2,0)),\"\",(VLOOKUP(B18,'200m.'!$E$8:$H$1000,2,0)))","v":""},{"$f":"IF(ISERROR(VLOOKUP(B18,'200m.'!$E$8:$G$1000,3,0)),\"\",(VLOOKUP(B18,'200m.'!$E$8:$G$1000,3,0)))","v":""},{"$f":"IF(ISERROR(VLOOKUP(B18,'800m.'!$E$8:$F$979,2,0)),\"\",(VLOOKUP(B18,'800m.'!$E$8:$H$979,2,0)))","v":""},{"$f":"IF(ISERROR(VLOOKUP(B18,'800m.'!$E$8:$G$979,3,0)),\"\",(VLOOKUP(B18,'800m.'!$E$8:$G$979,3,0)))","v":""},{"$f":"IF(ISERROR(VLOOKUP(B18,Yüksek!$F$8:$AG$1000,28,0)),\"\",(VLOOKUP(B18,Yüksek!$F$8:$AG$1000,28,0)))","v":""},{"$f":"IF(ISERROR(VLOOKUP(B18,Yüksek!$F$8:$AH$1000,29,0)),\"\",(VLOOKUP(B18,Yüksek!$F$8:$AH$1000,29,0)))","v":""},{"$f":"IF(ISERROR(VLOOKUP(B18,#REF!,6,0)),\"\",(VLOOKUP(B18,#REF!,6,0)))","v":""},{"$f":"IF(ISERROR(VLOOKUP(B18,#REF!,7,0)),\"\",(VLOOKUP(B18,#REF!,7,0)))","v":""},{"$f":"IF(ISERROR(VLOOKUP(D18,#REF!,6,0)),\"\",(VLOOKUP(D18,#REF!,6,0)))","v":""},{"$f":"IF(ISERROR(VLOOKUP(D18,#REF!,7,0)),\"\",(VLOOKUP(D18,#REF!,7,0)))","v":""},{"$f":"IF(ISERROR(VLOOKUP(F18,#REF!,6,0)),\"\",(VLOOKUP(F18,#REF!,6,0)))","v":""},{"$f":"IF(ISERROR(VLOOKUP(F18,#REF!,7,0)),\"\",(VLOOKUP(F18,#REF!,7,0)))","v":""},{"$f":"IF(ISERROR(VLOOKUP(L18,'800m.'!$E$8:$F$979,2,0)),\"\",(VLOOKUP(L18,'800m.'!$E$8:$H$979,2,0)))","v":""},{"$f":"IF(ISERROR(VLOOKUP(L18,'800m.'!$E$8:$G$979,3,0)),\"\",(VLOOKUP(L18,'800m.'!$E$8:$G$979,3,0)))","v":""},{"$f":"IF(ISERROR(VLOOKUP(J18,'4x100m.'!$E$8:$F$988,2,0)),\"\",(VLOOKUP(J18,'4x100m.'!$E$8:$H$988,2,0)))","v":""},{"$f":"IF(ISERROR(VLOOKUP(J18,'4x100m.'!$E$8:$G$988,3,0)),\"\",(VLOOKUP(J18,'4x100m.'!$E$8:$G$988,3,0)))","v":""},{"$f":"IF(ISERROR(VLOOKUP(L18,'4x100m.'!$E$8:$F$988,2,0)),\"\",(VLOOKUP(L18,'4x100m.'!$E$8:$H$988,2,0)))","v":""},{"$f":"IF(ISERROR(VLOOKUP(L18,'4x100m.'!$E$8:$G$988,3,0)),\"\",(VLOOKUP(L18,'4x100m.'!$E$8:$G$988,3,0)))","v":""},{"$f":"SUM(V18,W18)","v":0}]
[null,null,null,{"$f":"IF(ISERROR(VLOOKUP(B19,'100m.'!$E$8:$F$1010,2,0)),\"\",(VLOOKUP(B19,'100m.'!$E$8:$H$1010,2,0)))","v":""},{"$f":"IF(ISERROR(VLOOKUP(B19,'100m.'!$E$8:$G$1010,3,0)),\"\",(VLOOKUP(B19,'100m.'!$E$8:$G$1010,3,0)))","v":""},{"$f":"IF(ISERROR(VLOOKUP(B19,'200m.'!$E$8:$F$1000,2,0)),\"\",(VLOOKUP(B19,'200m.'!$E$8:$H$1000,2,0)))","v":""},{"$f":"IF(ISERROR(VLOOKUP(B19,'200m.'!$E$8:$G$1000,3,0)),\"\",(VLOOKUP(B19,'200m.'!$E$8:$G$1000,3,0)))","v":""},{"$f":"IF(ISERROR(VLOOKUP(B19,'800m.'!$E$8:$F$979,2,0)),\"\",(VLOOKUP(B19,'800m.'!$E$8:$H$979,2,0)))","v":""},{"$f":"IF(ISERROR(VLOOKUP(B19,'800m.'!$E$8:$G$979,3,0)),\"\",(VLOOKUP(B19,'800m.'!$E$8:$G$979,3,0)))","v":""},{"$f":"IF(ISERROR(VLOOKUP(B19,Yüksek!$F$8:$AG$1000,28,0)),\"\",(VLOOKUP(B19,Yüksek!$F$8:$AG$1000,28,0)))","v":""},{"$f":"IF(ISERROR(VLOOKUP(B19,Yüksek!$F$8:$AH$1000,29,0)),\"\",(VLOOKUP(B19,Yüksek!$F$8:$AH$1000,29,0)))","v":""},{"$f":"IF(ISERROR(VLOOKUP(B19,#REF!,6,0)),\"\",(VLOOKUP(B19,#REF!,6,0)))","v":""},{"$f":"IF(ISERROR(VLOOKUP(B19,#REF!,7,0)),\"\",(VLOOKUP(B19,#REF!,7,0)))","v":""},{"$f":"IF(ISERROR(VLOOKUP(D19,#REF!,6,0)),\"\",(VLOOKUP(D19,#REF!,6,0)))","v":""},{"$f":"IF(ISERROR(VLOOKUP(D19,#REF!,7,0)),\"\",(VLOOKUP(D19,#REF!,7,0)))","v":""},{"$f":"IF(ISERROR(VLOOKUP(F19,#REF!,6,0)),\"\",(VLOOKUP(F19,#REF!,6,0)))","v":""},{"$f":"IF(ISERROR(VLOOKUP(F19,#REF!,7,0)),\"\",(VLOOKUP(F19,#REF!,7,0)))","v":""},{"$f":"IF(ISERROR(VLOOKUP(L19,'800m.'!$E$8:$F$979,2,0)),\"\",(VLOOKUP(L19,'800m.'!$E$8:$H$979,2,0)))","v":""},{"$f":"IF(ISERROR(VLOOKUP(L19,'800m.'!$E$8:$G$979,3,0)),\"\",(VLOOKUP(L19,'800m.'!$E$8:$G$979,3,0)))","v":""},{"$f":"IF(ISERROR(VLOOKUP(J19,'4x100m.'!$E$8:$F$988,2,0)),\"\",(VLOOKUP(J19,'4x100m.'!$E$8:$H$988,2,0)))","v":""},{"$f":"IF(ISERROR(VLOOKUP(J19,'4x100m.'!$E$8:$G$988,3,0)),\"\",(VLOOKUP(J19,'4x100m.'!$E$8:$G$988,3,0)))","v":""},{"$f":"IF(ISERROR(VLOOKUP(L19,'4x100m.'!$E$8:$F$988,2,0)),\"\",(VLOOKUP(L19,'4x100m.'!$E$8:$H$988,2,0)))","v":""},{"$f":"IF(ISERROR(VLOOKUP(L19,'4x100m.'!$E$8:$G$988,3,0)),\"\",(VLOOKUP(L19,'4x100m.'!$E$8:$G$988,3,0)))","v":""},{"$f":"SUM(V19,W19)","v":0}]
[null,null,null,{"$f":"IF(ISERROR(VLOOKUP(B20,'100m.'!$E$8:$F$1010,2,0)),\"\",(VLOOKUP(B20,'100m.'!$E$8:$H$1010,2,0)))","v":""},{"$f":"IF(ISERROR(VLOOKUP(B20,'100m.'!$E$8:$G$1010,3,0)),\"\",(VLOOKUP(B20,'100m.'!$E$8:$G$1010,3,0)))","v":""},{"$f":"IF(ISERROR(VLOOKUP(B20,'200m.'!$E$8:$F$1000,2,0)),\"\",(VLOOKUP(B20,'200m.'!$E$8:$H$1000,2,0)))","v":""},{"$f":"IF(ISERROR(VLOOKUP(B20,'200m.'!$E$8:$G$1000,3,0)),\"\",(VLOOKUP(B20,'200m.'!$E$8:$G$1000,3,0)))","v":""},{"$f":"IF(ISERROR(VLOOKUP(B20,'800m.'!$E$8:$F$979,2,0)),\"\",(VLOOKUP(B20,'800m.'!$E$8:$H$979,2,0)))","v":""},{"$f":"IF(ISERROR(VLOOKUP(B20,'800m.'!$E$8:$G$979,3,0)),\"\",(VLOOKUP(B20,'800m.'!$E$8:$G$979,3,0)))","v":""},{"$f":"IF(ISERROR(VLOOKUP(B20,Yüksek!$F$8:$AG$1000,28,0)),\"\",(VLOOKUP(B20,Yüksek!$F$8:$AG$1000,28,0)))","v":""},{"$f":"IF(ISERROR(VLOOKUP(B20,Yüksek!$F$8:$AH$1000,29,0)),\"\",(VLOOKUP(B20,Yüksek!$F$8:$AH$1000,29,0)))","v":""},{"$f":"IF(ISERROR(VLOOKUP(B20,#REF!,6,0)),\"\",(VLOOKUP(B20,#REF!,6,0)))","v":""},{"$f":"IF(ISERROR(VLOOKUP(B20,#REF!,7,0)),\"\",(VLOOKUP(B20,#REF!,7,0)))","v":""},{"$f":"IF(ISERROR(VLOOKUP(D20,#REF!,6,0)),\"\",(VLOOKUP(D20,#REF!,6,0)))","v":""},{"$f":"IF(ISERROR(VLOOKUP(D20,#REF!,7,0)),\"\",(VLOOKUP(D20,#REF!,7,0)))","v":""},{"$f":"IF(ISERROR(VLOOKUP(F20,#REF!,6,0)),\"\",(VLOOKUP(F20,#REF!,6,0)))","v":""},{"$f":"IF(ISERROR(VLOOKUP(F20,#REF!,7,0)),\"\",(VLOOKUP(F20,#REF!,7,0)))","v":""},{"$f":"IF(ISERROR(VLOOKUP(L20,'800m.'!$E$8:$F$979,2,0)),\"\",(VLOOKUP(L20,'800m.'!$E$8:$H$979,2,0)))","v":""},{"$f":"IF(ISERROR(VLOOKUP(L20,'800m.'!$E$8:$G$979,3,0)),\"\",(VLOOKUP(L20,'800m.'!$E$8:$G$979,3,0)))","v":""},{"$f":"IF(ISERROR(VLOOKUP(J20,'4x100m.'!$E$8:$F$988,2,0)),\"\",(VLOOKUP(J20,'4x100m.'!$E$8:$H$988,2,0)))","v":""},{"$f":"IF(ISERROR(VLOOKUP(J20,'4x100m.'!$E$8:$G$988,3,0)),\"\",(VLOOKUP(J20,'4x100m.'!$E$8:$G$988,3,0)))","v":""},{"$f":"IF(ISERROR(VLOOKUP(L20,'4x100m.'!$E$8:$F$988,2,0)),\"\",(VLOOKUP(L20,'4x100m.'!$E$8:$H$988,2,0)))","v":""},{"$f":"IF(ISERROR(VLOOKUP(L20,'4x100m.'!$E$8:$G$988,3,0)),\"\",(VLOOKUP(L20,'4x100m.'!$E$8:$G$988,3,0)))","v":""},{"$f":"SUM(V20,W20)","v":0}]
[null,null,null,{"$f":"IF(ISERROR(VLOOKUP(B21,'100m.'!$E$8:$F$1010,2,0)),\"\",(VLOOKUP(B21,'100m.'!$E$8:$H$1010,2,0)))","v":""},{"$f":"IF(ISERROR(VLOOKUP(B21,'100m.'!$E$8:$G$1010,3,0)),\"\",(VLOOKUP(B21,'100m.'!$E$8:$G$1010,3,0)))","v":""},{"$f":"IF(ISERROR(VLOOKUP(B21,'200m.'!$E$8:$F$1000,2,0)),\"\",(VLOOKUP(B21,'200m.'!$E$8:$H$1000,2,0)))","v":""},{"$f":"IF(ISERROR(VLOOKUP(B21,'200m.'!$E$8:$G$1000,3,0)),\"\",(VLOOKUP(B21,'200m.'!$E$8:$G$1000,3,0)))","v":""},{"$f":"IF(ISERROR(VLOOKUP(B21,'800m.'!$E$8:$F$979,2,0)),\"\",(VLOOKUP(B21,'800m.'!$E$8:$H$979,2,0)))","v":""},{"$f":"IF(ISERROR(VLOOKUP(B21,'800m.'!$E$8:$G$979,3,0)),\"\",(VLOOKUP(B21,'800m.'!$E$8:$G$979,3,0)))","v":""},{"$f":"IF(ISERROR(VLOOKUP(B21,Yüksek!$F$8:$AG$1000,28,0)),\"\",(VLOOKUP(B21,Yüksek!$F$8:$AG$1000,28,0)))","v":""},{"$f":"IF(ISERROR(VLOOKUP(B21,Yüksek!$F$8:$AH$1000,29,0)),\"\",(VLOOKUP(B21,Yüksek!$F$8:$AH$1000,29,0)))","v":""},{"$f":"IF(ISERROR(VLOOKUP(B21,#REF!,6,0)),\"\",(VLOOKUP(B21,#REF!,6,0)))","v":""},{"$f":"IF(ISERROR(VLOOKUP(B21,#REF!,7,0)),\"\",(VLOOKUP(B21,#REF!,7,0)))","v":""},{"$f":"IF(ISERROR(VLOOKUP(D21,#REF!,6,0)),\"\",(VLOOKUP(D21,#REF!,6,0)))","v":""},{"$f":"IF(ISERROR(VLOOKUP(D21,#REF!,7,0)),\"\",(VLOOKUP(D21,#REF!,7,0)))","v":""},{"$f":"IF(ISERROR(VLOOKUP(F21,#REF!,6,0)),\"\",(VLOOKUP(F21,#REF!,6,0)))","v":""},{"$f":"IF(ISERROR(VLOOKUP(F21,#REF!,7,0)),\"\",(VLOOKUP(F21,#REF!,7,0)))","v":""},{"$f":"IF(ISERROR(VLOOKUP(L21,'800m.'!$E$8:$F$979,2,0)),\"\",(VLOOKUP(L21,'800m.'!$E$8:$H$979,2,0)))","v":""},{"$f":"IF(ISERROR(VLOOKUP(L21,'800m.'!$E$8:$G$979,3,0)),\"\",(VLOOKUP(L21,'800m.'!$E$8:$G$979,3,0)))","v":""},{"$f":"IF(ISERROR(VLOOKUP(J21,'4x100m.'!$E$8:$F$988,2,0)),\"\",(VLOOKUP(J21,'4x100m.'!$E$8:$H$988,2,0)))","v":""},{"$f":"IF(ISERROR(VLOOKUP(J21,'4x100m.'!$E$8:$G$988,3,0)),\"\",(VLOOKUP(J21,'4x100m.'!$E$8:$G$988,3,0)))","v":""},{"$f":"IF(ISERROR(VLOOKUP(L21,'4x100m.'!$E$8:$F$988,2,0)),\"\",(VLOOKUP(L21,'4x100m.'!$E$8:$H$988,2,0)))","v":""},{"$f":"IF(ISERROR(VLOOKUP(L21,'4x100m.'!$E$8:$G$988,3,0)),\"\",(VLOOKUP(L21,'4x100m.'!$E$8:$G$988,3,0)))","v":""},{"$f":"SUM(V21,W21)","v":0}]
[null,null,null,{"$f":"IF(ISERROR(VLOOKUP(B22,'100m.'!$E$8:$F$1010,2,0)),\"\",(VLOOKUP(B22,'100m.'!$E$8:$H$1010,2,0)))","v":""},{"$f":"IF(ISERROR(VLOOKUP(B22,'100m.'!$E$8:$G$1010,3,0)),\"\",(VLOOKUP(B22,'100m.'!$E$8:$G$1010,3,0)))","v":""},{"$f":"IF(ISERROR(VLOOKUP(B22,'200m.'!$E$8:$F$1000,2,0)),\"\",(VLOOKUP(B22,'200m.'!$E$8:$H$1000,2,0)))","v":""},{"$f":"IF(ISERROR(VLOOKUP(B22,'200m.'!$E$8:$G$1000,3,0)),\"\",(VLOOKUP(B22,'200m.'!$E$8:$G$1000,3,0)))","v":""},{"$f":"IF(ISERROR(VLOOKUP(B22,'800m.'!$E$8:$F$979,2,0)),\"\",(VLOOKUP(B22,'800m.'!$E$8:$H$979,2,0)))","v":""},{"$f":"IF(ISERROR(VLOOKUP(B22,'800m.'!$E$8:$G$979,3,0)),\"\",(VLOOKUP(B22,'800m.'!$E$8:$G$979,3,0)))","v":""},{"$f":"IF(ISERROR(VLOOKUP(B22,Yüksek!$F$8:$AG$1000,28,0)),\"\",(VLOOKUP(B22,Yüksek!$F$8:$AG$1000,28,0)))","v":""},{"$f":"IF(ISERROR(VLOOKUP(B22,Yüksek!$F$8:$AH$1000,29,0)),\"\",(VLOOKUP(B22,Yüksek!$F$8:$AH$1000,29,0)))","v":""},{"$f":"IF(ISERROR(VLOOKUP(B22,#REF!,6,0)),\"\",(VLOOKUP(B22,#REF!,6,0)))","v":""},{"$f":"IF(ISERROR(VLOOKUP(B22,#REF!,7,0)),\"\",(VLOOKUP(B22,#REF!,7,0)))","v":""},{"$f":"IF(ISERROR(VLOOKUP(D22,#REF!,6,0)),\"\",(VLOOKUP(D22,#REF!,6,0)))","v":""},{"$f":"IF(ISERROR(VLOOKUP(D22,#REF!,7,0)),\"\",(VLOOKUP(D22,#REF!,7,0)))","v":""},{"$f":"IF(ISERROR(VLOOKUP(F22,#REF!,6,0)),\"\",(VLOOKUP(F22,#REF!,6,0)))","v":""},{"$f":"IF(ISERROR(VLOOKUP(F22,#REF!,7,0)),\"\",(VLOOKUP(F22,#REF!,7,0)))","v":""},{"$f":"IF(ISERROR(VLOOKUP(L22,'800m.'!$E$8:$F$979,2,0)),\"\",(VLOOKUP(L22,'800m.'!$E$8:$H$979,2,0)))","v":""},{"$f":"IF(ISERROR(VLOOKUP(L22,'800m.'!$E$8:$G$979,3,0)),\"\",(VLOOKUP(L22,'800m.'!$E$8:$G$979,3,0)))","v":""},{"$f":"IF(ISERROR(VLOOKUP(J22,'4x100m.'!$E$8:$F$988,2,0)),\"\",(VLOOKUP(J22,'4x100m.'!$E$8:$H$988,2,0)))","v":""},{"$f":"IF(ISERROR(VLOOKUP(J22,'4x100m.'!$E$8:$G$988,3,0)),\"\",(VLOOKUP(J22,'4x100m.'!$E$8:$G$988,3,0)))","v":""},{"$f":"IF(ISERROR(VLOOKUP(L22,'4x100m.'!$E$8:$F$988,2,0)),\"\",(VLOOKUP(L22,'4x100m.'!$E$8:$H$988,2,0)))","v":""},{"$f":"IF(ISERROR(VLOOKUP(L22,'4x100m.'!$E$8:$G$988,3,0)),\"\",(VLOOKUP(L22,'4x100m.'!$E$8:$G$988,3,0)))","v":""},{"$f":"SUM(V22,W22)","v":0}]